BDBM50060802 CHEMBL414558::[Ac-L-2Nal1]acyline
SMILES: CC(C)C[C@H](NC(=O)[C@@H](Cc1ccc(NC(C)=O)cc1)NC(=O)[C@H](Cc1ccc(NC(C)=O)cc1)NC(=O)[C@H](CO)NC(=O)[C@@H](Cc1cccnc1)NC(=O)[C@@H](Cc1ccc(Cl)cc1)NC(=O)[C@H](Cc1ccc2ccccc2c1)NC(C)=O)C(=O)N[C@@H](CCCCNC(C)C)C(=O)N1CCC[C@@H]1C(=O)N[C@H](C)C(N)=O
InChI Key: InChIKey=ZWNUQDJANZGVFO-JYKZETIUSA-N
Data: 1 IC50
Activity Spreadsheet -- Enzyme Inhibition Constant Data from BindingDB
Found 1 hit for monomerid = 50060802
Trg + Lig
Ki
nM
ΔG°
kcal/mole
IC50
nM
Kd
nM
EC50/IC50
nM
koff
s-1
kon
M-1s-1
pHTemp
°C
Gonadotropin-releasing hormone receptor
(Rattus norvegicus)
BDBM50060802
(CHEMBL414558 | [Ac-L-2Nal1]acyline)
Show SMILES CC(C)C[C@H](NC(=O)[C@@H](Cc1ccc(NC(C)=O)cc1)NC(=O)[C@H](Cc1ccc(NC(C)=O)cc1)NC(=O)[C@H](CO)NC(=O)[C@@H](Cc1cccnc1)NC(=O)[C@@H](Cc1ccc(Cl)cc1)NC(=O)[C@H](Cc1ccc2ccccc2c1)NC(C)=O)C(=O)N[C@@H](CCCCNC(C)C)C(=O)N1CCC[C@@H]1C(=O)N[C@H](C)C(N)=O
Show InChI InChI=1S/C80H102ClN15O14/c1-46(2)37-63(72(102)89-62(18-11-12-35-84-47(3)4)80(110)96-36-14-19-70(96)79(109)85-48(5)71(82)101)90-74(104)66(40-53-23-30-60(31-24-53)86-49(6)98)92-76(106)67(41-54-25-32-61(33-26-54)87-50(7)99)94-78(108)69(45-97)95-77(107)68(43-56-15-13-34-83-44-56)93-75(105)65(39-52-21-28-59(81)29-22-52)91-73(103)64(88-51(8)100)42-55-20-27-57-16-9-10-17-58(57)38-55/h9-10,13,15-17,20-34,38,44,46-48,62-70,84,97H,11-12,14,18-19,35-37,39-43,45H2,1-8H3,(H2,82,101)(H,85,109)(H,86,98)(H,87,99)(H,88,100)(H,89,102)(H,90,104)(H,91,103)(H,92,106)(H,93,105)(H,94,108)(H,95,107)/t48-,62+,63+,64+,65-,66-,67+,68-,69+,70-/m1/s1
n/an/a 0.640n/an/an/an/an/an/a
Salk Institute
Curated by ChEMBL
Assay Description
Inhibition of binding of radiolabeled histrelin to Gonadotropin-releasing hormone receptor (GnRHr) in rat pituitary gland membranes
J Med Chem 40: 3739-48 (1997)
Article DOI: 10.1021/jm970024p
BindingDB Entry DOI: 10.7270/Q24J0D8X