BDBM50061105 (2R,3R,4S)-4-Benzo[1,3]dioxol-5-yl-2-(4-methoxy-phenyl)-1-{2-[(2-methyl-propane-1-sulfonyl)-propyl-amino]-ethyl}-pyrrolidine-3-carboxylic acid::CHEMBL110899
SMILES: CCCN(CCN1C[C@@H]([C@H]([C@@H]1c1ccc(OC)cc1)C(O)=O)c1ccc2OCOc2c1)S(=O)(=O)CC(C)C
InChI Key: InChIKey=KFYQTBHXMOGBAB-MVNQZMKCSA-N
Data: 2 IC50
Activity Spreadsheet -- Enzyme Inhibition Constant Data from BindingDB
Found 2 hits for monomerid = 50061105
Trg + Lig
Ki
nM
ΔG°
kcal/mole
IC50
nM
Kd
nM
EC50/IC50
nM
koff
s-1
kon
M-1s-1
pHTemp
°C
Endothelin receptor ET-B
(Sus scrofa)
BDBM50061105
((2R,3R,4S)-4-Benzo[1,3]dioxol-5-yl-2-(4-methoxy-ph...)
Show SMILES CCCN(CCN1C[C@@H]([C@H]([C@@H]1c1ccc(OC)cc1)C(O)=O)c1ccc2OCOc2c1)S(=O)(=O)CC(C)C
Show InChI InChI=1S/C28H38N2O7S/c1-5-12-30(38(33,34)17-19(2)3)14-13-29-16-23(21-8-11-24-25(15-21)37-18-36-24)26(28(31)32)27(29)20-6-9-22(35-4)10-7-20/h6-11,15,19,23,26-27H,5,12-14,16-18H2,1-4H3,(H,31,32)/t23-,26-,27+/m1/s1
Reactome pathway
n/an/a 5.20n/an/an/an/an/an/a
Abbott Laboratories
Curated by ChEMBL
Assay Description
Ability to displace endothelin ([125I]-ET-3) from endothelin B receptor derived from cerebellar tissue of porcine.
J Med Chem 40: 3217-27 (1997)
Article DOI: 10.1021/jm970101g
BindingDB Entry DOI: 10.7270/Q2C24VJR
EDNRA
(RAT)
BDBM50061105
((2R,3R,4S)-4-Benzo[1,3]dioxol-5-yl-2-(4-methoxy-ph...)
Show SMILES CCCN(CCN1C[C@@H]([C@H]([C@@H]1c1ccc(OC)cc1)C(O)=O)c1ccc2OCOc2c1)S(=O)(=O)CC(C)C
Show InChI InChI=1S/C28H38N2O7S/c1-5-12-30(38(33,34)17-19(2)3)14-13-29-16-23(21-8-11-24-25(15-21)37-18-36-24)26(28(31)32)27(29)20-6-9-22(35-4)10-7-20/h6-11,15,19,23,26-27H,5,12-14,16-18H2,1-4H3,(H,31,32)/t23-,26-,27+/m1/s1
Reactome pathway
n/an/a 0.780n/an/an/an/an/an/a
Abbott Laboratories
Curated by ChEMBL
Assay Description
Ability to displace endothelin ([125I]-ET-1) from endothelin A receptor derived from MMQ cells of rodent.
J Med Chem 40: 3217-27 (1997)
Article DOI: 10.1021/jm970101g
BindingDB Entry DOI: 10.7270/Q2C24VJR