null
SMILES: CCCCCCCCCCCCCCCC(=O)N[C@@H](COC1OC(CO)C(O)C(OS([O-])(=O)=O)C1O)[C@H](O)\C=C\CCCCCCCCCCCCC
InChI Key: InChIKey=CJGVDSGIQZDLDO-VNQXHBPZSA-M
Activity Spreadsheet -- Enzyme Inhibition Constant Data from BindingDB
Found 1 hit for monomerid = 50061133
Trg + Lig
Ki
nM
ΔG°
kcal/mole
IC50
nM
Kd
nM
EC50/IC50
nM
koff
s-1
kon
M-1s-1
pHTemp
°C
P-selectin
(Homo sapiens (Human))
BDBM50061133
((2S,3R,4E)-2-(Hexadecanoylamino)-3-hydroxy-1-[[3-O...)
Show SMILES CCCCCCCCCCCCCCCC(=O)N[C@@H](COC1OC(CO)C(O)C(OS([O-])(=O)=O)C1O)[C@H](O)\C=C\CCCCCCCCCCCCC
Show InChI InChI=1S/C40H77NO11S/c1-3-5-7-9-11-13-15-17-19-21-23-25-27-29-34(43)33(32-50-40-38(46)39(52-53(47,48)49)37(45)35(31-42)51-40)41-36(44)30-28-26-24-22-20-18-16-14-12-10-8-6-4-2/h27,29,33-35,37-40,42-43,45-46H,3-26,28,30-32H2,1-2H3,(H,41,44)(H,47,48,49)/p-1/b29-27+/t33-,34+,35?,37?,38?,39?,40?/m0/s1
NCI pathway
Reactome pathway
n/an/a 600n/an/an/an/an/an/a
Bristol-Myers Squibb Pharmaceutical Research Institute
Curated by ChEMBL
Assay Description
In vitro inhibitory concentration against Selectin P in a cell-free binding assay
J Med Chem 40: 3234-47 (1997)
Article DOI: 10.1021/jm9606960
BindingDB Entry DOI: 10.7270/Q21Z454Z