null
SMILES: CCCCCCCCCCCCCCCC(=O)N[C@@H](COC1OC(COS([O-])(=O)=O)C(OC(C)=O)C(OS([O-])(=O)=O)C1OCc1ccccc1)[C@H](OCc1ccccc1)\C=C\CCCCCCCCCCCCC
InChI Key: InChIKey=KAQGEAFHDPRZCP-ACPWSBDKSA-L
Activity Spreadsheet -- Enzyme Inhibition Constant Data from BindingDB
Found 1 hit for monomerid = 50061135
Trg + Lig
Ki
nM
ΔG°
kcal/mole
IC50
nM
Kd
nM
EC50/IC50
nM
koff
s-1
kon
M-1s-1
pHTemp
°C
P-selectin
(Homo sapiens (Human))
BDBM50061135
((2S,3R,4E)-3-(Benzoyloxy)-2-(hexadecanoylamino)-1-...)
Show SMILES CCCCCCCCCCCCCCCC(=O)N[C@@H](COC1OC(COS([O-])(=O)=O)C(OC(C)=O)C(OS([O-])(=O)=O)C1OCc1ccccc1)[C@H](OCc1ccccc1)\C=C\CCCCCCCCCCCCC
Show InChI InChI=1S/C56H91NO15S2/c1-4-6-8-10-12-14-16-18-20-22-24-26-34-40-50(66-42-47-36-30-28-31-37-47)49(57-52(59)41-35-27-25-23-21-19-17-15-13-11-9-7-5-2)44-68-56-55(67-43-48-38-32-29-33-39-48)54(72-74(63,64)65)53(70-46(3)58)51(71-56)45-69-73(60,61)62/h28-34,36-40,49-51,53-56H,4-27,35,41-45H2,1-3H3,(H,57,59)(H,60,61,62)(H,63,64,65)/p-2/b40-34+/t49-,50+,51?,53?,54?,55?,56?/m0/s1
NCI pathway
Reactome pathway
n/an/a 1.30E+3n/an/an/an/an/an/a
Bristol-Myers Squibb Pharmaceutical Research Institute
Curated by ChEMBL
Assay Description
In vitro inhibitory concentration against Selectin P in a cell-free binding assay
J Med Chem 40: 3234-47 (1997)
Article DOI: 10.1021/jm9606960
BindingDB Entry DOI: 10.7270/Q21Z454Z