BDBM50061592 CHEMBL3394056
SMILES: Cc1cc(ccn1)-c1cc2c(Oc3ccc(cc3[C@@]22COC(N)=N2)-c2cccnc2F)cn1
InChI Key: InChIKey=DMYNPXQDQNLGFR-VWLOTQADSA-N
Data: 1 KI  3 IC50
Activity Spreadsheet -- Enzyme Inhibition Constant Data from BindingDB
Found 4 hits for monomerid = 50061592
Trg + Lig
Ki
nM
ΔG°
kcal/mole
IC50
nM
Kd
nM
EC50/IC50
nM
koff
s-1
kon
M-1s-1
pHTemp
°C
Potassium voltage-gated channel subfamily H member 2
(Homo sapiens (Human))
BDBM50061592
(CHEMBL3394056)
Show SMILES Cc1cc(ccn1)-c1cc2c(Oc3ccc(cc3[C@@]22COC(N)=N2)-c2cccnc2F)cn1 |r,c:25|
Show InChI InChI=1S/C25H18FN5O2/c1-14-9-16(6-8-28-14)20-11-19-22(12-30-20)33-21-5-4-15(17-3-2-7-29-23(17)26)10-18(21)25(19)13-32-24(27)31-25/h2-12H,13H2,1H3,(H2,27,31)/t25-/m0/s1
Reactome pathway
>1.00E+4n/an/an/an/an/an/an/an/a
Amgen Inc.
Curated by ChEMBL
Assay Description
Displacement of [3H]dofetilide from human ERG expressed in HEK293 cells
Bioorg Med Chem Lett 25: 767-74 (2015)
Article DOI: 10.1016/j.bmcl.2014.12.092
BindingDB Entry DOI: 10.7270/Q21G0NXQ
Beta-secretase 1
(Homo sapiens (Human))
BDBM50061592
(CHEMBL3394056)
Show SMILES Cc1cc(ccn1)-c1cc2c(Oc3ccc(cc3[C@@]22COC(N)=N2)-c2cccnc2F)cn1 |r,c:25|
Show InChI InChI=1S/C25H18FN5O2/c1-14-9-16(6-8-28-14)20-11-19-22(12-30-20)33-21-5-4-15(17-3-2-7-29-23(17)26)10-18(21)25(19)13-32-24(27)31-25/h2-12H,13H2,1H3,(H2,27,31)/t25-/m0/s1
n/an/a 15n/an/an/an/an/an/a
Amgen Inc.
Curated by ChEMBL
Assay Description
Inhibition of BACE1 in HEK293T cells expressing APPswedish mutant assessed as inhibition of amyloid beta 40 production by sandwich ELISA
Bioorg Med Chem Lett 25: 767-74 (2015)
Article DOI: 10.1016/j.bmcl.2014.12.092
BindingDB Entry DOI: 10.7270/Q21G0NXQ
Cathepsin D
(Homo sapiens (Human))
BDBM50061592
(CHEMBL3394056)
Show SMILES Cc1cc(ccn1)-c1cc2c(Oc3ccc(cc3[C@@]22COC(N)=N2)-c2cccnc2F)cn1 |r,c:25|
Show InChI InChI=1S/C25H18FN5O2/c1-14-9-16(6-8-28-14)20-11-19-22(12-30-20)33-21-5-4-15(17-3-2-7-29-23(17)26)10-18(21)25(19)13-32-24(27)31-25/h2-12H,13H2,1H3,(H2,27,31)/t25-/m0/s1
NCI pathway
Reactome pathway
n/an/a 3.87E+3n/an/an/an/an/an/a
Amgen Inc.
Curated by ChEMBL
Assay Description
Inhibition of cathepsin D (unknown origin)
Bioorg Med Chem Lett 25: 767-74 (2015)
Article DOI: 10.1016/j.bmcl.2014.12.092
BindingDB Entry DOI: 10.7270/Q21G0NXQ
Beta-secretase 1
(Homo sapiens (Human))
BDBM50061592
(CHEMBL3394056)
Show SMILES Cc1cc(ccn1)-c1cc2c(Oc3ccc(cc3[C@@]22COC(N)=N2)-c2cccnc2F)cn1 |r,c:25|
Show InChI InChI=1S/C25H18FN5O2/c1-14-9-16(6-8-28-14)20-11-19-22(12-30-20)33-21-5-4-15(17-3-2-7-29-23(17)26)10-18(21)25(19)13-32-24(27)31-25/h2-12H,13H2,1H3,(H2,27,31)/t25-/m0/s1
n/an/a 2.40n/an/an/an/an/an/a
Amgen Inc.
Curated by ChEMBL
Assay Description
Inhibition of BACE1 (unknown origin) by fluorescence assay
Bioorg Med Chem Lett 25: 767-74 (2015)
Article DOI: 10.1016/j.bmcl.2014.12.092
BindingDB Entry DOI: 10.7270/Q21G0NXQ