null
SMILES: CCc1c(Sc2ccccc2)n(CCCc2ccccc2)c(=O)[nH]c1=O
InChI Key: InChIKey=WORIVTYCJIUINA-UHFFFAOYSA-N
Activity Spreadsheet -- Enzyme Inhibition Constant Data from BindingDB
Found 1 hit for monomerid = 50061698
Trg + Lig
Ki
nM
ΔG°
kcal/mole
IC50
nM
Kd
nM
EC50/IC50
nM
koff
s-1
kon
M-1s-1
pHTemp
°C
Reverse transcriptase/RNaseH
(Human immunodeficiency virus 1)
BDBM50061698
(5-Ethyl-1-(3-phenyl-propyl)-6-phenylsulfanyl-1H-py...)
Show SMILES CCc1c(Sc2ccccc2)n(CCCc2ccccc2)c(=O)[nH]c1=O
Show InChI InChI=1S/C21H22N2O2S/c1-2-18-19(24)22-21(25)23(15-9-12-16-10-5-3-6-11-16)20(18)26-17-13-7-4-8-14-17/h3-8,10-11,13-14H,2,9,12,15H2,1H3,(H,22,24,25)
n/an/an/an/a 290n/an/an/an/a
Université d'Orléans
Curated by ChEMBL
Assay Description
Inhibitory concentration against HIV-1 reverse transcriptase
J Med Chem 40: 4257-64 (1998)
Article DOI: 10.1021/jm970110p
BindingDB Entry DOI: 10.7270/Q2WS8SC3