null
SMILES: CN1C2=N[C@@H]3CCC[C@@H]3N2c2c(cnn2Cc2ccccc2)C1=O
InChI Key: InChIKey=FTBKIXUICIWBQE-CABCVRRESA-N
Activity Spreadsheet -- Enzyme Inhibition Constant Data from BindingDB
Found 2 hits for monomerid = 50061896
Trg + Lig
Ki
nM
ΔG°
kcal/mole
IC50
nM
Kd
nM
EC50/IC50
nM
koff
s-1
kon
M-1s-1
pHTemp
°C
cGMP-specific 3',5'-cyclic phosphodiesterase
(Bos taurus)
BDBM50061896
(CHEMBL343971 | Rac-(6aR*,9aS*)-5,6a,7,8,9,9a-Hexah...)
Show SMILES CN1C2=N[C@@H]3CCC[C@@H]3N2c2c(cnn2Cc2ccccc2)C1=O |t:2|
Show InChI InChI=1S/C18H19N5O/c1-21-17(24)13-10-19-22(11-12-6-3-2-4-7-12)16(13)23-15-9-5-8-14(15)20-18(21)23/h2-4,6-7,10,14-15H,5,8-9,11H2,1H3/t14-,15+/m1/s1
Reactome pathway
n/an/a 3.10E+3n/an/an/an/an/an/a
Schering-Plough Research Institute
Curated by ChEMBL
Assay Description
Inhibition of phosphodiesterase 5 from bovine lung
J Med Chem 40: 4372-7 (1998)
Article DOI: 10.1021/jm970495b
BindingDB Entry DOI: 10.7270/Q2833R45
Phosphodiesterase
(Bos taurus)
BDBM50061896
(CHEMBL343971 | Rac-(6aR*,9aS*)-5,6a,7,8,9,9a-Hexah...)
Show SMILES CN1C2=N[C@@H]3CCC[C@@H]3N2c2c(cnn2Cc2ccccc2)C1=O |t:2|
Show InChI InChI=1S/C18H19N5O/c1-21-17(24)13-10-19-22(11-12-6-3-2-4-7-12)16(13)23-15-9-5-8-14(15)20-18(21)23/h2-4,6-7,10,14-15H,5,8-9,11H2,1H3/t14-,15+/m1/s1
n/an/a 5.50E+4n/an/an/an/an/an/a
Schering-Plough Research Institute
Curated by ChEMBL
Assay Description
Inhibition of Phosphodiesterase 3 from bovine heart
J Med Chem 40: 4372-7 (1998)
Article DOI: 10.1021/jm970495b
BindingDB Entry DOI: 10.7270/Q2833R45