BDBM50062276 CHEMBL55247::Phosphoric acid mono-[5-(6-ethylamino-purin-9-yl)-2-phosphonooxymethyl-tetrahydro-furan-3-yl] ester
SMILES: CCNc1ncnc2n(cnc12)C1CC(OP(O)(O)=O)C(COP(O)(O)=O)O1
InChI Key: InChIKey=VFEOMJBNUNVQAO-UHFFFAOYSA-N
Data: 1 IC50
Activity Spreadsheet -- Enzyme Inhibition Constant Data from BindingDB
Found 1 hit for monomerid = 50062276
Trg + Lig
Ki
nM
ΔG°
kcal/mole
IC50
nM
Kd
nM
EC50/IC50
nM
koff
s-1
kon
M-1s-1
pHTemp
°C
P2Y purinoceptor 1
(Meleagris gallopavo)
BDBM50062276
(CHEMBL55247 | Phosphoric acid mono-[5-(6-ethylamin...)
Show SMILES CCNc1ncnc2n(cnc12)C1CC(OP(O)(O)=O)C(COP(O)(O)=O)O1
Show InChI InChI=1S/C12H19N5O9P2/c1-2-13-11-10-12(15-5-14-11)17(6-16-10)9-3-7(26-28(21,22)23)8(25-9)4-24-27(18,19)20/h5-9H,2-4H2,1H3,(H,13,14,15)(H2,18,19,20)(H2,21,22,23)
n/an/a 1.08E+3n/an/an/an/an/an/a
National Institute of Diabetes
Curated by ChEMBL
Assay Description
Antagonist activity at P2Y1 receptor measured as capacity to inhibit 50% of phospholipase C stimulation elicited by 10 nM 2-MeSATP
J Med Chem 41: 183-90 (1998)
Article DOI: 10.1021/jm970433l
BindingDB Entry DOI: 10.7270/Q2SX6DWZ