BDBM50062413 5-(3-Bromo-5-methyl-phenyl)-2,2,4-trimethyl-2,5-dihydro-1H-6-oxa-1-aza-chrysene::CHEMBL101907
SMILES: CC1=CC(C)(C)Nc2ccc3-c4ccccc4OC(c4cc(C)cc(Br)c4)c3c12
InChI Key: InChIKey=BDYFDDGUXXUNJN-UHFFFAOYSA-N
Data: 3 KI  4 IC50  1 EC50
Activity Spreadsheet -- Enzyme Inhibition Constant Data from BindingDB
Found 8 hits for monomerid = 50062413
Trg + Lig
Ki
nM
ΔG°
kcal/mole
IC50
nM
Kd
nM
EC50/IC50
nM
koff
s-1
kon
M-1s-1
pHTemp
°C
Progesterone receptor
(Homo sapiens (Human))
BDBM50062413
(5-(3-Bromo-5-methyl-phenyl)-2,2,4-trimethyl-2,5-di...)
Show SMILES CC1=CC(C)(C)Nc2ccc3-c4ccccc4OC(c4cc(C)cc(Br)c4)c3c12 |t:1|
Show InChI InChI=1S/C26H24BrNO/c1-15-11-17(13-18(27)12-15)25-24-20(19-7-5-6-8-22(19)29-25)9-10-21-23(24)16(2)14-26(3,4)28-21/h5-14,25,28H,1-4H3
0.870n/an/an/an/an/an/an/an/a
Ligand Pharmaceuticals, Inc.
Curated by ChEMBL
Assay Description
The binding affinity of the compound was determined on Human progesterone receptor (hPR-A) using progesterone as radioligand.
J Med Chem 41: 291-302 (1998)
Article DOI: 10.1021/jm9705768
BindingDB Entry DOI: 10.7270/Q29W0DMD
Glucocorticoid receptor
(Homo sapiens (Human))
BDBM50062413
(5-(3-Bromo-5-methyl-phenyl)-2,2,4-trimethyl-2,5-di...)
Show SMILES CC1=CC(C)(C)Nc2ccc3-c4ccccc4OC(c4cc(C)cc(Br)c4)c3c12 |t:1|
Show InChI InChI=1S/C26H24BrNO/c1-15-11-17(13-18(27)12-15)25-24-20(19-7-5-6-8-22(19)29-25)9-10-21-23(24)16(2)14-26(3,4)28-21/h5-14,25,28H,1-4H3
42n/an/an/an/an/an/an/an/a
Ligand Pharmaceuticals, Inc.
Curated by ChEMBL
Assay Description
Binding affinity was determined on Human glucocorticoid receptor (hAR) using progesterone as radioligand.
J Med Chem 41: 291-302 (1998)
Article DOI: 10.1021/jm9705768
BindingDB Entry DOI: 10.7270/Q29W0DMD
Androgen Receptor
(Homo sapiens (Human))
BDBM50062413
(5-(3-Bromo-5-methyl-phenyl)-2,2,4-trimethyl-2,5-di...)
Show SMILES CC1=CC(C)(C)Nc2ccc3-c4ccccc4OC(c4cc(C)cc(Br)c4)c3c12 |t:1|
Show InChI InChI=1S/C26H24BrNO/c1-15-11-17(13-18(27)12-15)25-24-20(19-7-5-6-8-22(19)29-25)9-10-21-23(24)16(2)14-26(3,4)28-21/h5-14,25,28H,1-4H3
NCI pathway
Reactome pathway
3.50E+3n/an/an/an/an/an/an/an/a
Ligand Pharmaceuticals, Inc.
Curated by ChEMBL
Assay Description
Binding affinity was determined on Human androgen receptor (hAR) using progesterone as radioligand.
J Med Chem 41: 291-302 (1998)
Article DOI: 10.1021/jm9705768
BindingDB Entry DOI: 10.7270/Q29W0DMD
Glucocorticoid receptor
(Homo sapiens (Human))
BDBM50062413
(5-(3-Bromo-5-methyl-phenyl)-2,2,4-trimethyl-2,5-di...)
Show SMILES CC1=CC(C)(C)Nc2ccc3-c4ccccc4OC(c4cc(C)cc(Br)c4)c3c12 |t:1|
Show InChI InChI=1S/C26H24BrNO/c1-15-11-17(13-18(27)12-15)25-24-20(19-7-5-6-8-22(19)29-25)9-10-21-23(24)16(2)14-26(3,4)28-21/h5-14,25,28H,1-4H3
n/an/a 166n/an/an/an/an/an/a
Ligand Pharmaceuticals, Inc.
Curated by ChEMBL
Assay Description
Antagonistic activity was determined in Human glucocorticoid receptor(hGR) of CV-1 cells in cotransfection assay.
J Med Chem 41: 291-302 (1998)
Article DOI: 10.1021/jm9705768
BindingDB Entry DOI: 10.7270/Q29W0DMD
Progesterone receptor
(Homo sapiens (Human))
BDBM50062413
(5-(3-Bromo-5-methyl-phenyl)-2,2,4-trimethyl-2,5-di...)
Show SMILES CC1=CC(C)(C)Nc2ccc3-c4ccccc4OC(c4cc(C)cc(Br)c4)c3c12 |t:1|
Show InChI InChI=1S/C26H24BrNO/c1-15-11-17(13-18(27)12-15)25-24-20(19-7-5-6-8-22(19)29-25)9-10-21-23(24)16(2)14-26(3,4)28-21/h5-14,25,28H,1-4H3
n/an/a 1.10E+3n/an/an/an/an/an/a
Ligand Pharmaceuticals, Inc.
Curated by ChEMBL
Assay Description
Antagonistic activity was determined in Human progesterone receptor(hPR) of CV-1 cells in cotransfection assay.
J Med Chem 41: 291-302 (1998)
Article DOI: 10.1021/jm9705768
BindingDB Entry DOI: 10.7270/Q29W0DMD
Mineralocorticoid receptor
(Homo sapiens (Human))
BDBM50062413
(5-(3-Bromo-5-methyl-phenyl)-2,2,4-trimethyl-2,5-di...)
Show SMILES CC1=CC(C)(C)Nc2ccc3-c4ccccc4OC(c4cc(C)cc(Br)c4)c3c12 |t:1|
Show InChI InChI=1S/C26H24BrNO/c1-15-11-17(13-18(27)12-15)25-24-20(19-7-5-6-8-22(19)29-25)9-10-21-23(24)16(2)14-26(3,4)28-21/h5-14,25,28H,1-4H3
n/an/a>1.00E+4n/an/an/an/an/an/a
Ligand Pharmaceuticals, Inc.
Curated by ChEMBL
Assay Description
Antagonistic activity was determined in Human mineralocorticoid receptor(hMR) of CV-1 cells in cotransfection assay.
J Med Chem 41: 291-302 (1998)
Article DOI: 10.1021/jm9705768
BindingDB Entry DOI: 10.7270/Q29W0DMD
Androgen Receptor
(Homo sapiens (Human))
BDBM50062413
(5-(3-Bromo-5-methyl-phenyl)-2,2,4-trimethyl-2,5-di...)
Show SMILES CC1=CC(C)(C)Nc2ccc3-c4ccccc4OC(c4cc(C)cc(Br)c4)c3c12 |t:1|
Show InChI InChI=1S/C26H24BrNO/c1-15-11-17(13-18(27)12-15)25-24-20(19-7-5-6-8-22(19)29-25)9-10-21-23(24)16(2)14-26(3,4)28-21/h5-14,25,28H,1-4H3
NCI pathway
Reactome pathway
n/an/a 1.24E+3n/an/an/an/an/an/a
Ligand Pharmaceuticals, Inc.
Curated by ChEMBL
Assay Description
Antagonistic activity was determined in Human androgen receptor(hAR) of CV-1 cells in cotransfection assay.
J Med Chem 41: 291-302 (1998)
Article DOI: 10.1021/jm9705768
BindingDB Entry DOI: 10.7270/Q29W0DMD
Progesterone receptor
(Homo sapiens (Human))
BDBM50062413
(5-(3-Bromo-5-methyl-phenyl)-2,2,4-trimethyl-2,5-di...)
Show SMILES CC1=CC(C)(C)Nc2ccc3-c4ccccc4OC(c4cc(C)cc(Br)c4)c3c12 |t:1|
Show InChI InChI=1S/C26H24BrNO/c1-15-11-17(13-18(27)12-15)25-24-20(19-7-5-6-8-22(19)29-25)9-10-21-23(24)16(2)14-26(3,4)28-21/h5-14,25,28H,1-4H3
n/an/an/an/a 17n/an/an/an/a
Ligand Pharmaceuticals, Inc.
Curated by ChEMBL
Assay Description
Agonistic activity to the human progesterone receptor(hPR)assayed in CV-1 cells in cotransfection assay.
J Med Chem 41: 291-302 (1998)
Article DOI: 10.1021/jm9705768
BindingDB Entry DOI: 10.7270/Q29W0DMD