BDBM50062428 9-Chloro-2,2,4-trimethyl-5-(3-trifluoromethyl-phenyl)-2,5-dihydro-1H-6-oxa-1-aza-chrysene::CHEMBL431807
SMILES: CC1=CC(C)(C)Nc2ccc3-c4cc(Cl)ccc4OC(c4cccc(c4)C(F)(F)F)c3c12
InChI Key: InChIKey=YSWIPPWIWOBVFS-UHFFFAOYSA-N
Data: 1 KI  1 EC50
Activity Spreadsheet -- Enzyme Inhibition Constant Data from BindingDB
Found 2 hits for monomerid = 50062428
Trg + Lig
Ki
nM
ΔG°
kcal/mole
IC50
nM
Kd
nM
EC50/IC50
nM
koff
s-1
kon
M-1s-1
pHTemp
°C
Progesterone receptor
(Homo sapiens (Human))
BDBM50062428
(9-Chloro-2,2,4-trimethyl-5-(3-trifluoromethyl-phen...)
Show SMILES CC1=CC(C)(C)Nc2ccc3-c4cc(Cl)ccc4OC(c4cccc(c4)C(F)(F)F)c3c12 |t:1|
Show InChI InChI=1S/C26H21ClF3NO/c1-14-13-25(2,3)31-20-9-8-18-19-12-17(27)7-10-21(19)32-24(23(18)22(14)20)15-5-4-6-16(11-15)26(28,29)30/h4-13,24,31H,1-3H3
1.10n/an/an/an/an/an/an/an/a
Ligand Pharmaceuticals, Inc.
Curated by ChEMBL
Assay Description
The binding affinity measured using baculovirus-expressed hPR-A in sf21 cells.
J Med Chem 41: 303-10 (1998)
Article DOI: 10.1021/jm9705770
BindingDB Entry DOI: 10.7270/Q2RV0PC8
Progesterone receptor
(Homo sapiens (Human))
BDBM50062428
(9-Chloro-2,2,4-trimethyl-5-(3-trifluoromethyl-phen...)
Show SMILES CC1=CC(C)(C)Nc2ccc3-c4cc(Cl)ccc4OC(c4cccc(c4)C(F)(F)F)c3c12 |t:1|
Show InChI InChI=1S/C26H21ClF3NO/c1-14-13-25(2,3)31-20-9-8-18-19-12-17(27)7-10-21(19)32-24(23(18)22(14)20)15-5-4-6-16(11-15)26(28,29)30/h4-13,24,31H,1-3H3
n/an/an/an/a 7.40n/an/an/an/a
Ligand Pharmaceuticals, Inc.
Curated by ChEMBL
Assay Description
Agonistic activity was measured for modulation of hPR-B (human progesterone receptor) in co-transfected CV-1 cells.
J Med Chem 41: 303-10 (1998)
Article DOI: 10.1021/jm9705770
BindingDB Entry DOI: 10.7270/Q2RV0PC8