BDBM50062441 9-Fluoro-2,2,4-trimethyl-5-phenyl-2,5-dihydro-1H-6-oxa-1-aza-chrysene::CHEMBL104037
SMILES: CC1=CC(C)(C)Nc2ccc3-c4cc(F)ccc4OC(c4ccccc4)c3c12
InChI Key: InChIKey=VXRLIUYZYDZKBE-UHFFFAOYSA-N
Data: 1 KI  1 EC50
Activity Spreadsheet -- Enzyme Inhibition Constant Data from BindingDB
Found 2 hits for monomerid = 50062441
Trg + Lig
Ki
nM
ΔG°
kcal/mole
IC50
nM
Kd
nM
EC50/IC50
nM
koff
s-1
kon
M-1s-1
pHTemp
°C
Progesterone receptor
(Homo sapiens (Human))
BDBM50062441
(9-Fluoro-2,2,4-trimethyl-5-phenyl-2,5-dihydro-1H-6...)
Show SMILES CC1=CC(C)(C)Nc2ccc3-c4cc(F)ccc4OC(c4ccccc4)c3c12 |t:1|
Show InChI InChI=1S/C25H22FNO/c1-15-14-25(2,3)27-20-11-10-18-19-13-17(26)9-12-21(19)28-24(23(18)22(15)20)16-7-5-4-6-8-16/h4-14,24,27H,1-3H3
2.20n/an/an/an/an/an/an/an/a
Ligand Pharmaceuticals, Inc.
Curated by ChEMBL
Assay Description
The binding affinity measured using baculovirus-expressed hPR-A in sf21 cells.
J Med Chem 41: 303-10 (1998)
Article DOI: 10.1021/jm9705770
BindingDB Entry DOI: 10.7270/Q2RV0PC8
Progesterone receptor
(Homo sapiens (Human))
BDBM50062441
(9-Fluoro-2,2,4-trimethyl-5-phenyl-2,5-dihydro-1H-6...)
Show SMILES CC1=CC(C)(C)Nc2ccc3-c4cc(F)ccc4OC(c4ccccc4)c3c12 |t:1|
Show InChI InChI=1S/C25H22FNO/c1-15-14-25(2,3)27-20-11-10-18-19-13-17(26)9-12-21(19)28-24(23(18)22(15)20)16-7-5-4-6-8-16/h4-14,24,27H,1-3H3
n/an/an/an/a 7.40n/an/an/an/a
Ligand Pharmaceuticals, Inc.
Curated by ChEMBL
Assay Description
Agonistic activity was measured for modulation of hPR-B (human progesterone receptor) in co-transfected CV-1 cells.
J Med Chem 41: 303-10 (1998)
Article DOI: 10.1021/jm9705770
BindingDB Entry DOI: 10.7270/Q2RV0PC8