BDBM50062502 CHEMBL3397517
SMILES: COc1c(C)cc(cc1C(=O)NC1CCCCCC1)-c1ccc(F)cc1
InChI Key: InChIKey=HTDJFIUVOFCYFF-UHFFFAOYSA-N
Data: 2 KI  1 EC50
Activity Spreadsheet -- Enzyme Inhibition Constant Data from BindingDB
Found 3 hits for monomerid = 50062502
Trg + Lig
Ki
nM
ΔG°
kcal/mole
IC50
nM
Kd
nM
EC50/IC50
nM
koff
s-1
kon
M-1s-1
pHTemp
°C
Cannabinoid receptor 2
(Homo sapiens (Human))
BDBM50062502
(CHEMBL3397517)
Show SMILES COc1c(C)cc(cc1C(=O)NC1CCCCCC1)-c1ccc(F)cc1
Show InChI InChI=1S/C22H26FNO2/c1-15-13-17(16-9-11-18(23)12-10-16)14-20(21(15)26-2)22(25)24-19-7-5-3-4-6-8-19/h9-14,19H,3-8H2,1-2H3,(H,24,25)
Reactome pathway
60n/an/an/an/an/an/an/an/a
Universit£ di Pisa
Curated by ChEMBL
Assay Description
Displacement of [3H]CP55,940 from human recombinant CB1 receptor expressed in HEK293 cell membranes after 90 mins
Eur J Med Chem 90: 526-36 (2015)
Article DOI: 10.1016/j.ejmech.2014.11.066
BindingDB Entry DOI: 10.7270/Q270833D
Cannabinoid receptor 1
(Homo sapiens (Human))
BDBM50062502
(CHEMBL3397517)
Show SMILES COc1c(C)cc(cc1C(=O)NC1CCCCCC1)-c1ccc(F)cc1
Show InChI InChI=1S/C22H26FNO2/c1-15-13-17(16-9-11-18(23)12-10-16)14-20(21(15)26-2)22(25)24-19-7-5-3-4-6-8-19/h9-14,19H,3-8H2,1-2H3,(H,24,25)
NCI pathway
Reactome pathway
160n/an/an/an/an/an/an/an/a
Universit£ di Pisa
Curated by ChEMBL
Assay Description
Displacement of [3H]CP55,940 from human recombinant CB1 receptor expressed in HEK293 cell membranes after 90 mins
Eur J Med Chem 90: 526-36 (2015)
Article DOI: 10.1016/j.ejmech.2014.11.066
BindingDB Entry DOI: 10.7270/Q270833D
Cannabinoid receptor 2
(Homo sapiens (Human))
BDBM50062502
(CHEMBL3397517)
Show SMILES COc1c(C)cc(cc1C(=O)NC1CCCCCC1)-c1ccc(F)cc1
Show InChI InChI=1S/C22H26FNO2/c1-15-13-17(16-9-11-18(23)12-10-16)14-20(21(15)26-2)22(25)24-19-7-5-3-4-6-8-19/h9-14,19H,3-8H2,1-2H3,(H,24,25)
Reactome pathway
n/an/an/an/a 398n/an/an/an/a
Universit£ di Pisa
Curated by ChEMBL
Assay Description
Displacement of [3H]CP55,940 from human recombinant CB1 receptor expressed in HEK293 cell membranes after 90 mins
Eur J Med Chem 90: 526-36 (2015)
Article DOI: 10.1016/j.ejmech.2014.11.066
BindingDB Entry DOI: 10.7270/Q270833D