BDBM50062624 (S)-1-(2,3-Dihydro-benzo[1,4]dioxine-2-carbonyl)-pyrrolidine-2-carboxylic acid (4-amino-cyclohexylmethyl)-amide::CHEMBL420689
SMILES: NC1CCC(CNC(=O)[C@@H]2CCCN2C(=O)C2COc3ccccc3O2)CC1
InChI Key: InChIKey=NDXXIBJDVBVFKU-LDWRGQNGSA-N
Data: 1 KI  1 IC50
Activity Spreadsheet -- Enzyme Inhibition Constant Data from BindingDB
Found 2 hits for monomerid = 50062624
Trg + Lig
Ki
nM
ΔG°
kcal/mole
IC50
nM
Kd
nM
EC50/IC50
nM
koff
s-1
kon
M-1s-1
pHTemp
°C
Prothrombin
(Homo sapiens (Human))
BDBM50062624
((S)-1-(2,3-Dihydro-benzo[1,4]dioxine-2-carbonyl)-p...)
Show SMILES NC1CCC(CNC(=O)[C@@H]2CCCN2C(=O)C2COc3ccccc3O2)CC1 |wU:9.8,(15.05,-.52,;14.47,-1.96,;14.44,-3.4,;15.77,-5.05,;14.58,-6.38,;14.98,-7.87,;14.35,-9.26,;12.84,-9.43,;12.21,-10.82,;11.93,-8.19,;12.4,-6.73,;11.16,-5.82,;9.93,-6.73,;10.4,-8.19,;9.49,-9.43,;10.12,-10.82,;7.95,-9.26,;7.33,-7.85,;5.81,-7.68,;4.91,-8.91,;3.4,-8.75,;2.47,-9.98,;3.09,-11.4,;4.63,-11.57,;5.51,-10.33,;7.05,-10.5,;14.56,-4.85,;13.28,-3.29,)|
Show InChI InChI=1S/C21H29N3O4/c22-15-9-7-14(8-10-15)12-23-20(25)16-4-3-11-24(16)21(26)19-13-27-17-5-1-2-6-18(17)28-19/h1-2,5-6,14-16,19H,3-4,7-13,22H2,(H,23,25)/t14?,15?,16-,19?/m0/s1
75n/an/an/an/an/an/an/an/a
Merck Research Laboratories
Curated by ChEMBL
Assay Description
Binding affinity towards thrombin was determined
J Med Chem 41: 401-6 (1998)
Article DOI: 10.1021/jm9705014
BindingDB Entry DOI: 10.7270/Q2H995V2
Prothrombin
(Homo sapiens (Human))
BDBM50062624
((S)-1-(2,3-Dihydro-benzo[1,4]dioxine-2-carbonyl)-p...)
Show SMILES NC1CCC(CNC(=O)[C@@H]2CCCN2C(=O)C2COc3ccccc3O2)CC1 |wU:9.8,(15.05,-.52,;14.47,-1.96,;14.44,-3.4,;15.77,-5.05,;14.58,-6.38,;14.98,-7.87,;14.35,-9.26,;12.84,-9.43,;12.21,-10.82,;11.93,-8.19,;12.4,-6.73,;11.16,-5.82,;9.93,-6.73,;10.4,-8.19,;9.49,-9.43,;10.12,-10.82,;7.95,-9.26,;7.33,-7.85,;5.81,-7.68,;4.91,-8.91,;3.4,-8.75,;2.47,-9.98,;3.09,-11.4,;4.63,-11.57,;5.51,-10.33,;7.05,-10.5,;14.56,-4.85,;13.28,-3.29,)|
Show InChI InChI=1S/C21H29N3O4/c22-15-9-7-14(8-10-15)12-23-20(25)16-4-3-11-24(16)21(26)19-13-27-17-5-1-2-6-18(17)28-19/h1-2,5-6,14-16,19H,3-4,7-13,22H2,(H,23,25)/t14?,15?,16-,19?/m0/s1
n/an/a 100n/an/an/an/an/an/a
Merck Research Laboratories
Curated by ChEMBL
Assay Description
Inhibition of thrombin-catalyzed hydrolysis of a standard substrate
J Med Chem 41: 401-6 (1998)
Article DOI: 10.1021/jm9705014
BindingDB Entry DOI: 10.7270/Q2H995V2