BDBM50062658 3-[(2-Chloro-4-trifluoromethyl-pyrimidine-5-carbonyl)-amino]-5-trifluoromethyl-benzoic acid ethyl ester::CHEMBL134490
SMILES: CCOC(=O)c1cc(NC(=O)c2cnc(Cl)nc2C(F)(F)F)cc(c1)C(F)(F)F
InChI Key: InChIKey=CLAOSCDDLTTWAL-UHFFFAOYSA-N
Data: 2 IC50
Activity Spreadsheet -- Enzyme Inhibition Constant Data from BindingDB
Found 2 hits for monomerid = 50062658
Trg + Lig
Ki
nM
ΔG°
kcal/mole
IC50
nM
Kd
nM
EC50/IC50
nM
koff
s-1
kon
M-1s-1
pHTemp
°C
Nuclear factor NF-kappa-B (NF-kB)
(Homo sapiens (Human))
BDBM50062658
(3-[(2-Chloro-4-trifluoromethyl-pyrimidine-5-carbon...)
Show SMILES CCOC(=O)c1cc(NC(=O)c2cnc(Cl)nc2C(F)(F)F)cc(c1)C(F)(F)F
Show InChI InChI=1S/C16H10ClF6N3O3/c1-2-29-13(28)7-3-8(15(18,19)20)5-9(4-7)25-12(27)10-6-24-14(17)26-11(10)16(21,22)23/h3-6H,2H2,1H3,(H,25,27)
n/an/a 280n/an/an/an/an/an/a
Signal Pharmaceuticals, Inc.
Curated by ChEMBL
Assay Description
In vitro inhibitory activity against human Jurkat T-Cells stably transfected with an Nuclear factor kappa B transcription factor
J Med Chem 41: 413-9 (1998)
Article DOI: 10.1021/jm970671g
BindingDB Entry DOI: 10.7270/Q2P55MMZ
Activating transcription factor 1
(Homo sapiens (Human))
BDBM50062658
(3-[(2-Chloro-4-trifluoromethyl-pyrimidine-5-carbon...)
Show SMILES CCOC(=O)c1cc(NC(=O)c2cnc(Cl)nc2C(F)(F)F)cc(c1)C(F)(F)F
Show InChI InChI=1S/C16H10ClF6N3O3/c1-2-29-13(28)7-3-8(15(18,19)20)5-9(4-7)25-12(27)10-6-24-14(17)26-11(10)16(21,22)23/h3-6H,2H2,1H3,(H,25,27)
NCI pathway
Reactome pathway
n/an/a 150n/an/an/an/an/an/a
Signal Pharmaceuticals, Inc.
Curated by ChEMBL
Assay Description
In vitro inhibitory activity against human Jurkat T-Cells stably transfected with activating transcription factor 1
J Med Chem 41: 413-9 (1998)
Article DOI: 10.1021/jm970671g
BindingDB Entry DOI: 10.7270/Q2P55MMZ