BDBM50062794 CHEMBL341673::{(S)-1-[2-(4-Carbamimidoyl-benzoylamino)-acetyl]-4-methoxycarbonylmethyl-3-oxo-piperazin-2-yl}-acetic acid
SMILES: COC(=O)CN1CCN([C@@H](CC(O)=O)C1=O)C(=O)CNC(=O)c1ccc(cc1)C(N)=N
InChI Key: InChIKey=RXIOXTFLJJOEFS-ZDUSSCGKSA-N
Data: 3 IC50
Activity Spreadsheet -- Enzyme Inhibition Constant Data from BindingDB
Found 3 hits for monomerid = 50062794
Trg + Lig
Ki
nM
ΔG°
kcal/mole
IC50
nM
Kd
nM
EC50/IC50
nM
koff
s-1
kon
M-1s-1
pHTemp
°C
Integrin alpha-IIb/beta-3
(Homo sapiens (Human))
BDBM50062794
(CHEMBL341673 | {(S)-1-[2-(4-Carbamimidoyl-benzoyla...)
Show SMILES COC(=O)CN1CCN([C@@H](CC(O)=O)C1=O)C(=O)CNC(=O)c1ccc(cc1)C(N)=N
Show InChI InChI=1S/C19H23N5O7/c1-31-16(28)10-23-6-7-24(13(19(23)30)8-15(26)27)14(25)9-22-18(29)12-4-2-11(3-5-12)17(20)21/h2-5,13H,6-10H2,1H3,(H3,20,21)(H,22,29)(H,26,27)/t13-/m0/s1
n/an/a 20n/an/an/an/an/an/a
Takeda Chemical Industries, Ltd.
Curated by ChEMBL
Assay Description
Ability to inhibit binding of biotin-labeled human fibrinogen to immobilized fibrinogen receptor purified from human erythroleukemia(HEL) cells.
J Med Chem 41: 489-502 (1998)
Article DOI: 10.1021/jm970235u
BindingDB Entry DOI: 10.7270/Q2571B4W
Integrin alpha-IIb/beta-3
(Homo sapiens (Human))
BDBM50062794
(CHEMBL341673 | {(S)-1-[2-(4-Carbamimidoyl-benzoyla...)
Show SMILES COC(=O)CN1CCN([C@@H](CC(O)=O)C1=O)C(=O)CNC(=O)c1ccc(cc1)C(N)=N
Show InChI InChI=1S/C19H23N5O7/c1-31-16(28)10-23-6-7-24(13(19(23)30)8-15(26)27)14(25)9-22-18(29)12-4-2-11(3-5-12)17(20)21/h2-5,13H,6-10H2,1H3,(H3,20,21)(H,22,29)(H,26,27)/t13-/m0/s1
n/an/a 2.60E+3n/an/an/an/an/an/a
Takeda Chemical Industries, Ltd.
Curated by ChEMBL
Assay Description
Concentration required to inhibit adenosine diphosphate (ADP) induced aggregation of human platelets by 50% in vitro.
J Med Chem 41: 489-502 (1998)
Article DOI: 10.1021/jm970235u
BindingDB Entry DOI: 10.7270/Q2571B4W
Integrin alpha-IIb/beta-3
(Homo sapiens (Human))
BDBM50062794
(CHEMBL341673 | {(S)-1-[2-(4-Carbamimidoyl-benzoyla...)
Show SMILES COC(=O)CN1CCN([C@@H](CC(O)=O)C1=O)C(=O)CNC(=O)c1ccc(cc1)C(N)=N
Show InChI InChI=1S/C19H23N5O7/c1-31-16(28)10-23-6-7-24(13(19(23)30)8-15(26)27)14(25)9-22-18(29)12-4-2-11(3-5-12)17(20)21/h2-5,13H,6-10H2,1H3,(H3,20,21)(H,22,29)(H,26,27)/t13-/m0/s1
n/an/a 1.80E+3n/an/an/an/an/an/a
Takeda Chemical Industries, Ltd.
Curated by ChEMBL
Assay Description
Concentration required to inhibit adenosine diphosphate (ADP) induced aggregation of guinea pig platelets by 50% in vitro
J Med Chem 41: 489-502 (1998)
Article DOI: 10.1021/jm970235u
BindingDB Entry DOI: 10.7270/Q2571B4W