BDBM50063012 CHEMBL3398100
SMILES: Cc1cc(C)cc(Cn2c(=O)ccn(CC(=O)NCc3ccccc3)c2=O)c1
InChI Key: InChIKey=XGHUDSWXEFMDHG-UHFFFAOYSA-N
Data: 1 IC50
Activity Spreadsheet -- Enzyme Inhibition Constant Data from BindingDB
Found 1 hit for monomerid = 50063012
Trg + Lig
Ki
nM
ΔG°
kcal/mole
IC50
nM
Kd
nM
EC50/IC50
nM
koff
s-1
kon
M-1s-1
pHTemp
°C
Reverse transcriptase
(Human immunodeficiency virus 1)
BDBM50063012
(CHEMBL3398100)
Show SMILES Cc1cc(C)cc(Cn2c(=O)ccn(CC(=O)NCc3ccccc3)c2=O)c1
Show InChI InChI=1S/C22H23N3O3/c1-16-10-17(2)12-19(11-16)14-25-21(27)8-9-24(22(25)28)15-20(26)23-13-18-6-4-3-5-7-18/h3-12H,13-15H2,1-2H3,(H,23,26)
n/an/a 1.94E+5n/an/an/an/an/an/a
Volgograd State Medical University
Curated by ChEMBL
Assay Description
Inhibition of HIV1 recombinant wild type reverse transcriptase p66/p51 pre-incubated with compound before enzyme addition using poly(rA) template and...
Bioorg Med Chem 23: 1069-81 (2015)
Article DOI: 10.1016/j.bmc.2015.01.002
BindingDB Entry DOI: 10.7270/Q2RR20XW