BDBM50063016 CHEMBL3398103
SMILES: Clc1ccccc1NC(=O)Cn1ccc(=O)n(Cc2cccc3ccccc23)c1=O
InChI Key: InChIKey=QKMZADHMGOOKGW-UHFFFAOYSA-N
Data: 1 IC50
Activity Spreadsheet -- Enzyme Inhibition Constant Data from BindingDB
Found 1 hit for monomerid = 50063016
Trg + Lig
Ki
nM
ΔG°
kcal/mole
IC50
nM
Kd
nM
EC50/IC50
nM
koff
s-1
kon
M-1s-1
pHTemp
°C
Reverse transcriptase
(Human immunodeficiency virus 1)
BDBM50063016
(CHEMBL3398103)
Show SMILES Clc1ccccc1NC(=O)Cn1ccc(=O)n(Cc2cccc3ccccc23)c1=O
Show InChI InChI=1S/C23H18ClN3O3/c24-19-10-3-4-11-20(19)25-21(28)15-26-13-12-22(29)27(23(26)30)14-17-8-5-7-16-6-1-2-9-18(16)17/h1-13H,14-15H2,(H,25,28)
n/an/a 4.45E+4n/an/an/an/an/an/a
Volgograd State Medical University
Curated by ChEMBL
Assay Description
Inhibition of HIV1 recombinant wild type reverse transcriptase p66/p51 pre-incubated with compound before enzyme addition using poly(rA) template and...
Bioorg Med Chem 23: 1069-81 (2015)
Article DOI: 10.1016/j.bmc.2015.01.002
BindingDB Entry DOI: 10.7270/Q2RR20XW