BDBM50063054 CHEMBL3398165
SMILES: CC(C)(C)C(=O)Oc1ccc(cc1)S(=O)(=O)Nc1ccccc1C(=O)OCCO
InChI Key: InChIKey=OMVZRWSTCVAYPK-UHFFFAOYSA-N
Data: 3 IC50
Activity Spreadsheet -- Enzyme Inhibition Constant Data from BindingDB
Found 3 hits for monomerid = 50063054
Trg + Lig
Ki
nM
ΔG°
kcal/mole
IC50
nM
Kd
nM
EC50/IC50
nM
koff
s-1
kon
M-1s-1
pHTemp
°C
Cathepsin G
(Homo sapiens (Human))
BDBM50063054
(CHEMBL3398165)
Show SMILES CC(C)(C)C(=O)Oc1ccc(cc1)S(=O)(=O)Nc1ccccc1C(=O)OCCO
Show InChI InChI=1S/C20H23NO7S/c1-20(2,3)19(24)28-14-8-10-15(11-9-14)29(25,26)21-17-7-5-4-6-16(17)18(23)27-13-12-22/h4-11,21-22H,12-13H2,1-3H3
NCI pathway
Reactome pathway
n/an/a>1n/an/an/an/an/an/a
Chang Gung University
Curated by ChEMBL
Assay Description
Inhibition of human cathepsin G using N-succinyl-Ala-Ala-Pro-Phe-p-nitroanilide as substrate measured for 180 mins by spectrophotometry
Bioorg Med Chem 23: 1123-34 (2015)
Article DOI: 10.1016/j.bmc.2014.12.056
BindingDB Entry DOI: 10.7270/Q2CJ8G5M
Leukocyte proteinase 3
(Homo sapiens (Human))
BDBM50063054
(CHEMBL3398165)
Show SMILES CC(C)(C)C(=O)Oc1ccc(cc1)S(=O)(=O)Nc1ccccc1C(=O)OCCO
Show InChI InChI=1S/C20H23NO7S/c1-20(2,3)19(24)28-14-8-10-15(11-9-14)29(25,26)21-17-7-5-4-6-16(17)18(23)27-13-12-22/h4-11,21-22H,12-13H2,1-3H3
NCI pathway
Reactome pathway
n/an/a 61n/an/an/an/an/an/a
Chang Gung University
Curated by ChEMBL
Assay Description
Inhibition of Pr3 (unknown origin) using t-butyloxycarbonyl-Ala-Ala-Nva-thiobenzyl ester as substrate measured for 180 mins by spectrophotometry
Bioorg Med Chem 23: 1123-34 (2015)
Article DOI: 10.1016/j.bmc.2014.12.056
BindingDB Entry DOI: 10.7270/Q2CJ8G5M
Leukocyte elastase
(Homo sapiens (Human))
BDBM50063054
(CHEMBL3398165)
Show SMILES CC(C)(C)C(=O)Oc1ccc(cc1)S(=O)(=O)Nc1ccccc1C(=O)OCCO
Show InChI InChI=1S/C20H23NO7S/c1-20(2,3)19(24)28-14-8-10-15(11-9-14)29(25,26)21-17-7-5-4-6-16(17)18(23)27-13-12-22/h4-11,21-22H,12-13H2,1-3H3
Reactome pathway
n/an/a 29n/an/an/an/an/an/a
Chang Gung University
Curated by ChEMBL
Assay Description
Inhibition of human neutrophil elastase measured for 30 mins by spectrophotometry
Bioorg Med Chem 23: 1123-34 (2015)
Article DOI: 10.1016/j.bmc.2014.12.056
BindingDB Entry DOI: 10.7270/Q2CJ8G5M