BDBM50063079 CHEMBL3398404
SMILES: Cc1oc(cc1C(=O)NC(CC(O)=O)c1cccc(F)c1)C(C)(C)C
InChI Key: InChIKey=XCQYBSGOXSMAQW-UHFFFAOYSA-N
Data: 1 IC50
Activity Spreadsheet -- Enzyme Inhibition Constant Data from BindingDB
Found 1 hit for monomerid = 50063079
Trg + Lig
Ki
nM
ΔG°
kcal/mole
IC50
nM
Kd
nM
EC50/IC50
nM
koff
s-1
kon
M-1s-1
pHTemp
°C
Cytochrome CYP26A1
(Homo sapiens (Human))
BDBM50063079
(CHEMBL3398404)
Show SMILES Cc1oc(cc1C(=O)NC(CC(O)=O)c1cccc(F)c1)C(C)(C)C
Show InChI InChI=1S/C19H22FNO4/c1-11-14(9-16(25-11)19(2,3)4)18(24)21-15(10-17(22)23)12-6-5-7-13(20)8-12/h5-9,15H,10H2,1-4H3,(H,21,24)(H,22,23)
Reactome pathway
n/an/a 2.81E+3n/an/an/an/an/an/a
Key Laboratory of Structure-Based Drug Design and Discovery (Shenyang Pharmaceutical University)
Curated by ChEMBL
Assay Description
Inhibition of CYP26A1 in ATRA-induced human HL60 cell microsomes incubated for 30 mins using ATRA and NADPH by HPLC method
Bioorg Med Chem 23: 1356-65 (2015)
Article DOI: 10.1016/j.bmc.2014.11.036
BindingDB Entry DOI: 10.7270/Q2416ZQG