BDBM50063730 6,7-Dichloro-2-(2-chloro-phenylamino)-benzo[d][1,3]oxazin-4-one::CHEMBL274137
SMILES: Clc1cc2nc(Nc3ccccc3Cl)oc(=O)c2cc1Cl
InChI Key: InChIKey=LSPKRLJAHNETQS-UHFFFAOYSA-N
Data: 2 IC50
Activity Spreadsheet -- Enzyme Inhibition Constant Data from BindingDB
Found 2 hits for monomerid = 50063730
Trg + Lig
Ki
nM
ΔG°
kcal/mole
IC50
nM
Kd
nM
EC50/IC50
nM
koff
s-1
kon
M-1s-1
pHTemp
°C
Complement C1r subcomponent
(Homo sapiens (Human))
BDBM50063730
(6,7-Dichloro-2-(2-chloro-phenylamino)-benzo[d][1,3...)
Show SMILES Clc1cc2nc(Nc3ccccc3Cl)oc(=O)c2cc1Cl
Show InChI InChI=1S/C14H7Cl3N2O2/c15-8-3-1-2-4-11(8)18-14-19-12-6-10(17)9(16)5-7(12)13(20)21-14/h1-6H,(H,18,19)
Reactome pathway
n/an/a>6.25E+4n/an/an/an/an/an/a
Warner-Lambert Company
Curated by ChEMBL
Assay Description
50% inhibition of human C1r serine protease after 60 mins using CbzGly-Arg-S-Bzl as substrate
J Med Chem 41: 1060-7 (1998)
Article DOI: 10.1021/jm970394d
BindingDB Entry DOI: 10.7270/Q2PZ57ZT
Complement C1r subcomponent
(Homo sapiens (Human))
BDBM50063730
(6,7-Dichloro-2-(2-chloro-phenylamino)-benzo[d][1,3...)
Show SMILES Clc1cc2nc(Nc3ccccc3Cl)oc(=O)c2cc1Cl
Show InChI InChI=1S/C14H7Cl3N2O2/c15-8-3-1-2-4-11(8)18-14-19-12-6-10(17)9(16)5-7(12)13(20)21-14/h1-6H,(H,18,19)
Reactome pathway
n/an/a 2.00E+3n/an/an/an/an/an/a
Warner-Lambert Company
Curated by ChEMBL
Assay Description
Inhibition of 50% of human C1r Serine Protease by initially using CbzGly-Arg-S-Bzl as substrate
J Med Chem 41: 1060-7 (1998)
Article DOI: 10.1021/jm970394d
BindingDB Entry DOI: 10.7270/Q2PZ57ZT