BDBM50063849 CHEMBL3397486
SMILES: [Na+].[Na+].[H][C@@]1(O[C@H]2[C@@H](O)[C@@H](CO)O[C@H](OC[C@@H](O)[C@@H](O)[C@H](O)[C@@H](O)CNc3cccc(NC(=O)CCCCC4CCSS4)c3)[C@@H]2NC(C)=O)O[C@@H]([C@@H](O)[C@H](O)[C@H]1OS([O-])(=O)=O)C([O-])=O
InChI Key: InChIKey=CADLKJUNYRPSTK-MTROHVIHSA-L
Data: 1 Kd
Activity Spreadsheet -- Enzyme Inhibition Constant Data from BindingDB
Found 1 hit for monomerid = 50063849
Trg + Lig
Ki
nM
ΔG°
kcal/mole
IC50
nM
Kd
nM
EC50/IC50
nM
koff
s-1
kon
M-1s-1
pHTemp
°C
Fibroblast growth factor 2
(Homo sapiens (Human))
BDBM50063849
(CHEMBL3397486)
Show SMILES [Na+].[Na+].[H][C@@]1(O[C@H]2[C@@H](O)[C@@H](CO)O[C@H](OC[C@@H](O)[C@@H](O)[C@H](O)[C@@H](O)CNc3cccc(NC(=O)CCCCC4CCSS4)c3)[C@@H]2NC(C)=O)O[C@@H]([C@@H](O)[C@H](O)[C@H]1OS([O-])(=O)=O)C([O-])=O |r|
Show InChI InChI=1S/C34H53N3O20S3.2Na/c1-15(39)36-23-29(55-34-31(57-60(50,51)52)28(47)27(46)30(56-34)32(48)49)26(45)21(13-38)54-33(23)53-14-20(41)25(44)24(43)19(40)12-35-16-5-4-6-17(11-16)37-22(42)8-3-2-7-18-9-10-58-59-18;;/h4-6,11,18-21,23-31,33-35,38,40-41,43-47H,2-3,7-10,12-14H2,1H3,(H,36,39)(H,37,42)(H,48,49)(H,50,51,52);;/q;2*+1/p-2/t18?,19-,20+,21+,23+,24+,25+,26-,27-,28-,29+,30-,31+,33-,34+;;/m0../s1
Reactome pathway
n/an/an/a 62n/an/an/an/an/a
Kagoshima University
Curated by ChEMBL
Assay Description
Binding affinity to basic fibroblast growth factor (unknown origin) using sugar chip immobilized compound by surface plasmon resonance method
Bioorg Med Chem Lett 25: 1407-11 (2015)
Article DOI: 10.1016/j.bmcl.2015.02.054
BindingDB Entry DOI: 10.7270/Q2FB54N5