BDBM50063860 CHEMBL3403621
SMILES: OC(=O)CC1CCCc2c1[nH]c1ccc(OCc3ccc(C4CCCC4)c(c3)C(F)(F)F)cc21
InChI Key: InChIKey=IQWGVONGFYIGMI-UHFFFAOYSA-N
Data: 2 EC50
Activity Spreadsheet -- Enzyme Inhibition Constant Data from BindingDB
Found 2 hits for monomerid = 50063860
Trg + Lig
Ki
nM
ΔG°
kcal/mole
IC50
nM
Kd
nM
EC50/IC50
nM
koff
s-1
kon
M-1s-1
pHTemp
°C
Sphingosine 1-phosphate receptor 1
(Homo sapiens (Human))
BDBM50063860
(CHEMBL3403621)
Show SMILES OC(=O)CC1CCCc2c1[nH]c1ccc(OCc3ccc(C4CCCC4)c(c3)C(F)(F)F)cc21
Show InChI InChI=1S/C27H28F3NO3/c28-27(29,30)23-12-16(8-10-20(23)17-4-1-2-5-17)15-34-19-9-11-24-22(14-19)21-7-3-6-18(13-25(32)33)26(21)31-24/h8-12,14,17-18,31H,1-7,13,15H2,(H,32,33)
Reactome pathway
n/an/an/an/a 1.40n/an/an/an/a
Arena Pharmaceuticals Inc.
Curated by ChEMBL
Assay Description
Agonist activity at human S1P1 receptor assessed as change in cAMP level by homogeneous time resolved fluorescence cyclase assay
Bioorg Med Chem Lett 25: 659-63 (2015)
Article DOI: 10.1016/j.bmcl.2014.11.089
BindingDB Entry DOI: 10.7270/Q25T3N5P
Sphingosine 1-phosphate receptor 1
(Homo sapiens (Human))
BDBM50063860
(CHEMBL3403621)
Show SMILES OC(=O)CC1CCCc2c1[nH]c1ccc(OCc3ccc(C4CCCC4)c(c3)C(F)(F)F)cc21
Show InChI InChI=1S/C27H28F3NO3/c28-27(29,30)23-12-16(8-10-20(23)17-4-1-2-5-17)15-34-19-9-11-24-22(14-19)21-7-3-6-18(13-25(32)33)26(21)31-24/h8-12,14,17-18,31H,1-7,13,15H2,(H,32,33)
Reactome pathway
n/an/an/an/a 2n/an/an/an/a
Arena Pharmaceuticals Inc.
Curated by ChEMBL
Assay Description
Agonist activity at human S1P1 receptor assessed as change in cAMP level by homogeneous time resolved fluorescence cyclase assay
Bioorg Med Chem Lett 25: 659-63 (2015)
Article DOI: 10.1016/j.bmcl.2014.11.089
BindingDB Entry DOI: 10.7270/Q25T3N5P