BDBM50063941 5,6-Dichloro-1-(4-chloro-benzyl)-1H-benzoimidazol-2-ylamine::CHEMBL22714
SMILES: Nc1nc2cc(Cl)c(Cl)cc2n1Cc1ccc(Cl)cc1
InChI Key: InChIKey=CMTBKRRPDXVGHL-UHFFFAOYSA-N
Data: 1 IC50
Activity Spreadsheet -- Enzyme Inhibition Constant Data from BindingDB
Found 1 hit for monomerid = 50063941
Trg + Lig
Ki
nM
ΔG°
kcal/mole
IC50
nM
Kd
nM
EC50/IC50
nM
koff
s-1
kon
M-1s-1
pHTemp
°C
Human immunodeficiency virus type 1 reverse transcriptase
(Human immunodeficiency virus 1)
BDBM50063941
(5,6-Dichloro-1-(4-chloro-benzyl)-1H-benzoimidazol-...)
Show SMILES Nc1nc2cc(Cl)c(Cl)cc2n1Cc1ccc(Cl)cc1
Show InChI InChI=1S/C14H10Cl3N3/c15-9-3-1-8(2-4-9)7-20-13-6-11(17)10(16)5-12(13)19-14(20)18/h1-6H,7H2,(H2,18,19)
n/an/a 1.00E+4n/an/an/an/an/an/a
University of Michigan
Curated by ChEMBL
Assay Description
Antiviral activity against Human Immunodeficiency Virus by Reverse transcriptase (RT) assay in CEM-SS cells
J Med Chem 41: 1252-62 (1998)
Article DOI: 10.1021/jm970559i
BindingDB Entry DOI: 10.7270/Q2P26X8J