BDBM50064074 4-Oxo-2-[3-((E)-2-quinolin-2-yl-vinyl)-phenyl]-4H-chromene-8-carboxylic acid::CHEMBL284624
SMILES: OC(=O)c1cccc2c1oc(cc2=O)-c1cccc(\C=C\c2ccc3ccccc3n2)c1
InChI Key: InChIKey=ZECLHDRRSBEUDJ-ACCUITESSA-N
Data: 1 IC50  1 Kd
Activity Spreadsheet -- Enzyme Inhibition Constant Data from BindingDB
Found 2 hits for monomerid = 50064074
Trg + Lig
Ki
nM
ΔG°
kcal/mole
IC50
nM
Kd
nM
EC50/IC50
nM
koff
s-1
kon
M-1s-1
pHTemp
°C
Cysteinyl leukotriene receptor 1
(GUINEA PIG)
BDBM50064074
(4-Oxo-2-[3-((E)-2-quinolin-2-yl-vinyl)-phenyl]-4H-...)
Show SMILES OC(=O)c1cccc2c1oc(cc2=O)-c1cccc(\C=C\c2ccc3ccccc3n2)c1
Show InChI InChI=1S/C27H17NO4/c29-24-16-25(32-26-21(24)8-4-9-22(26)27(30)31)19-7-3-5-17(15-19)11-13-20-14-12-18-6-1-2-10-23(18)28-20/h1-16H,(H,30,31)/b13-11+
n/an/a 17n/an/an/an/an/an/a
Vrije Universiteit
Curated by ChEMBL
Assay Description
Binding affinity of the compound towards Cysteinyl leukotriene D4 receptor (cysLT1) was measured by the displacement of [3H]-LTD4 radioligand
J Med Chem 41: 1439-45 (1998)
Article DOI: 10.1021/jm970180w
BindingDB Entry DOI: 10.7270/Q2WH2P4P
Cysteinyl leukotriene receptor 1
(GUINEA PIG)
BDBM50064074
(4-Oxo-2-[3-((E)-2-quinolin-2-yl-vinyl)-phenyl]-4H-...)
Show SMILES OC(=O)c1cccc2c1oc(cc2=O)-c1cccc(\C=C\c2ccc3ccccc3n2)c1
Show InChI InChI=1S/C27H17NO4/c29-24-16-25(32-26-21(24)8-4-9-22(26)27(30)31)19-7-3-5-17(15-19)11-13-20-14-12-18-6-1-2-10-23(18)28-20/h1-16H,(H,30,31)/b13-11+
n/an/an/a 17n/an/an/an/an/a
Vrije Universiteit
Curated by ChEMBL
Assay Description
In vitro affinity for CysLT1 receptors on guinea pig lung membranes, measured by displacement of [3H]-LTD4.
J Med Chem 41: 1428-38 (1998)
Article DOI: 10.1021/jm970179x
BindingDB Entry DOI: 10.7270/Q21835MZ