BDBM50064145 CHEMBL3401120
SMILES: CC(C)[C@@H]1COCCN1c1nc(cc(=O)n1C)-c1ccncc1F
InChI Key: InChIKey=FPWPDIRVOBKAGL-HNNXBMFYSA-N
Data: 1 IC50
Activity Spreadsheet -- Enzyme Inhibition Constant Data from BindingDB
Found 1 hit for monomerid = 50064145
Trg + Lig
Ki
nM
ΔG°
kcal/mole
IC50
nM
Kd
nM
EC50/IC50
nM
koff
s-1
kon
M-1s-1
pHTemp
°C
Glycogen synthase kinase-3 beta
(Homo sapiens (Human))
BDBM50064145
(CHEMBL3401120)
Show SMILES CC(C)[C@@H]1COCCN1c1nc(cc(=O)n1C)-c1ccncc1F |r|
Show InChI InChI=1S/C17H21FN4O2/c1-11(2)15-10-24-7-6-22(15)17-20-14(8-16(23)21(17)3)12-4-5-19-9-13(12)18/h4-5,8-9,11,15H,6-7,10H2,1-3H3/t15-/m0/s1
NCI pathway
Reactome pathway
n/an/a 14n/an/an/an/an/an/a
Mitsubishi Tanabe Pharma Corporation
Curated by ChEMBL
Assay Description
Inhibition of human recombinant GSK3beta assessed as inhibition of [gamma32P]ATP after 1 hr by liquid scintillation counting in presence of prephosph...
Bioorg Med Chem Lett 25: 1086-91 (2015)
Article DOI: 10.1016/j.bmcl.2015.01.005
BindingDB Entry DOI: 10.7270/Q2WD428R