BDBM50064154 CHEMBL3401129
SMILES: [H][C@@]12CCC[C@@]1([H])N(CCO2)c1nc(cc(=O)n1C)-c1ccncc1F
InChI Key: InChIKey=IKJQAMMPHAQXBH-HUUCEWRRSA-N
Data: 4 IC50
Activity Spreadsheet -- Enzyme Inhibition Constant Data from BindingDB
Found 4 hits for monomerid = 50064154
Trg + Lig
Ki
nM
ΔG°
kcal/mole
IC50
nM
Kd
nM
EC50/IC50
nM
koff
s-1
kon
M-1s-1
pHTemp
°C
Glycogen synthase kinase-3 beta
(Homo sapiens (Human))
BDBM50064154
(CHEMBL3401129)
Show SMILES [H][C@@]12CCC[C@@]1([H])N(CCO2)c1nc(cc(=O)n1C)-c1ccncc1F |r|
Show InChI InChI=1S/C17H19FN4O2/c1-21-16(23)9-13(11-5-6-19-10-12(11)18)20-17(21)22-7-8-24-15-4-2-3-14(15)22/h5-6,9-10,14-15H,2-4,7-8H2,1H3/t14-,15-/m1/s1
NCI pathway
Reactome pathway
n/an/a 4.20n/an/an/an/an/an/a
Mitsubishi Tanabe Pharma Corporation
Curated by ChEMBL
Assay Description
Inhibition of human recombinant GSK3beta assessed as inhibition of [gamma32P]ATP after 1 hr by liquid scintillation counting in presence of prephosph...
Bioorg Med Chem Lett 25: 1086-91 (2015)
Article DOI: 10.1016/j.bmcl.2015.01.005
BindingDB Entry DOI: 10.7270/Q2WD428R
Cytochrome P450 3A4
(Homo sapiens (Human))
BDBM50064154
(CHEMBL3401129)
Show SMILES [H][C@@]12CCC[C@@]1([H])N(CCO2)c1nc(cc(=O)n1C)-c1ccncc1F |r|
Show InChI InChI=1S/C17H19FN4O2/c1-21-16(23)9-13(11-5-6-19-10-12(11)18)20-17(21)22-7-8-24-15-4-2-3-14(15)22/h5-6,9-10,14-15H,2-4,7-8H2,1H3/t14-,15-/m1/s1
Reactome pathway
n/an/a 4.45E+5n/an/an/an/an/an/a
Mitsubishi Tanabe Pharma Corporation
Curated by ChEMBL
Assay Description
Inhibition of recombinant human CYP3A4
Bioorg Med Chem Lett 25: 1086-91 (2015)
Article DOI: 10.1016/j.bmcl.2015.01.005
BindingDB Entry DOI: 10.7270/Q2WD428R
Cytochrome P450 2D6
(Homo sapiens (Human))
BDBM50064154
(CHEMBL3401129)
Show SMILES [H][C@@]12CCC[C@@]1([H])N(CCO2)c1nc(cc(=O)n1C)-c1ccncc1F |r|
Show InChI InChI=1S/C17H19FN4O2/c1-21-16(23)9-13(11-5-6-19-10-12(11)18)20-17(21)22-7-8-24-15-4-2-3-14(15)22/h5-6,9-10,14-15H,2-4,7-8H2,1H3/t14-,15-/m1/s1
n/an/a>5.00E+4n/an/an/an/an/an/a
Mitsubishi Tanabe Pharma Corporation
Curated by ChEMBL
Assay Description
Inhibition of recombinant human CYP2D6
Bioorg Med Chem Lett 25: 1086-91 (2015)
Article DOI: 10.1016/j.bmcl.2015.01.005
BindingDB Entry DOI: 10.7270/Q2WD428R
Cytochrome P450 1A
(Homo sapiens (Human))
BDBM50064154
(CHEMBL3401129)
Show SMILES [H][C@@]12CCC[C@@]1([H])N(CCO2)c1nc(cc(=O)n1C)-c1ccncc1F |r|
Show InChI InChI=1S/C17H19FN4O2/c1-21-16(23)9-13(11-5-6-19-10-12(11)18)20-17(21)22-7-8-24-15-4-2-3-14(15)22/h5-6,9-10,14-15H,2-4,7-8H2,1H3/t14-,15-/m1/s1
Reactome pathway
n/an/a 2.10E+4n/an/an/an/an/an/a
Mitsubishi Tanabe Pharma Corporation
Curated by ChEMBL
Assay Description
Inhibition of recombinant human CYP1A2
Bioorg Med Chem Lett 25: 1086-91 (2015)
Article DOI: 10.1016/j.bmcl.2015.01.005
BindingDB Entry DOI: 10.7270/Q2WD428R