BDBM50064413 CHEMBL3401168
SMILES: CCCCCCCCCCCCCCCCOP1(=O)OCCC(C(=O)OC)=C(C)O1
InChI Key: InChIKey=UQUOYRVMTVUYSM-UHFFFAOYSA-N
Data: 1 IC50
Activity Spreadsheet -- Enzyme Inhibition Constant Data from BindingDB
Found 1 hit for monomerid = 50064413
Trg + Lig
Ki
nM
ΔG°
kcal/mole
IC50
nM
Kd
nM
EC50/IC50
nM
koff
s-1
kon
M-1s-1
pHTemp
°C
Hormone-sensitive lipase (HSL)
(Rattus norvegicus (Rat))
BDBM50064413
(CHEMBL3401168)
Show SMILES CCCCCCCCCCCCCCCCOP1(=O)OCCC(C(=O)OC)=C(C)O1 |t:26|
Show InChI InChI=1S/C23H43O6P/c1-4-5-6-7-8-9-10-11-12-13-14-15-16-17-19-27-30(25)28-20-18-22(21(2)29-30)23(24)26-3/h4-20H2,1-3H3
n/an/a 60n/an/an/an/an/an/a
University of Missouri St. Louis
Curated by ChEMBL
Assay Description
Inhibition of rat hormone sensitive lipase assessed as oleic acid release from [3H]triolein by scintillation counting
Bioorg Med Chem 23: 944-52 (2015)
Article DOI: 10.1016/j.bmc.2015.01.028
BindingDB Entry DOI: 10.7270/Q23X88BP