BDBM50064769 CHEMBL3401255
SMILES: Cc1ccc2OCCn3c(nc4cc(ccc34)[N+]([O-])=O)-c2c1
InChI Key: InChIKey=CIJHTMWPSWHFCE-UHFFFAOYSA-N
Data: 4 IC50
Activity Spreadsheet -- Enzyme Inhibition Constant Data from BindingDB
Found 4 hits for monomerid = 50064769
Trg + Lig
Ki
nM
ΔG°
kcal/mole
IC50
nM
Kd
nM
EC50/IC50
nM
koff
s-1
kon
M-1s-1
pHTemp
°C
Phosphatidylinositol 4,5-bisphosphate 3-kinase catalytic subunit gamma isoform
(Homo sapiens (Human))
BDBM50064769
(CHEMBL3401255)
Show SMILES Cc1ccc2OCCn3c(nc4cc(ccc34)[N+]([O-])=O)-c2c1
Show InChI InChI=1S/C16H13N3O3/c1-10-2-5-15-12(8-10)16-17-13-9-11(19(20)21)3-4-14(13)18(16)6-7-22-15/h2-5,8-9H,6-7H2,1H3
NCI pathway
Reactome pathway
n/an/a 9.44E+3n/an/an/an/an/an/a
Nanjing University
Curated by ChEMBL
Assay Description
Inhibition of recombinant PI3Kgamma (unknown origin) using PI(3,4)P2 as substrate after 3 hrs incubation by competitive fluorescence polarization kin...
Bioorg Med Chem 23: 1231-40 (2015)
Article DOI: 10.1016/j.bmc.2015.01.052
BindingDB Entry DOI: 10.7270/Q2BC417K
Phosphatidylinositol 4,5-bisphosphate 3-kinase catalytic subunit delta isoform
(Homo sapiens (Human))
BDBM50064769
(CHEMBL3401255)
Show SMILES Cc1ccc2OCCn3c(nc4cc(ccc34)[N+]([O-])=O)-c2c1
Show InChI InChI=1S/C16H13N3O3/c1-10-2-5-15-12(8-10)16-17-13-9-11(19(20)21)3-4-14(13)18(16)6-7-22-15/h2-5,8-9H,6-7H2,1H3
NCI pathway
Reactome pathway
n/an/a 3.46E+4n/an/an/an/an/an/a
Nanjing University
Curated by ChEMBL
Assay Description
Inhibition of recombinant PI3Kdelta (unknown origin) using PI(3,4)P2 as substrate after 3 hrs incubation by competitive fluorescence polarization kin...
Bioorg Med Chem 23: 1231-40 (2015)
Article DOI: 10.1016/j.bmc.2015.01.052
BindingDB Entry DOI: 10.7270/Q2BC417K
Phosphatidylinositol 4,5-bisphosphate 3-kinase catalytic subunit alpha isoform
(Homo sapiens (Human))
BDBM50064769
(CHEMBL3401255)
Show SMILES Cc1ccc2OCCn3c(nc4cc(ccc34)[N+]([O-])=O)-c2c1
Show InChI InChI=1S/C16H13N3O3/c1-10-2-5-15-12(8-10)16-17-13-9-11(19(20)21)3-4-14(13)18(16)6-7-22-15/h2-5,8-9H,6-7H2,1H3
NCI pathway
Reactome pathway
n/an/a 16n/an/an/an/an/an/a
Nanjing University
Curated by ChEMBL
Assay Description
Inhibition of recombinant PI3Kalpha (unknown origin) using PI(3,4)P2 as substrate after 3 hrs incubation by competitive fluorescence polarization kin...
Bioorg Med Chem 23: 1231-40 (2015)
Article DOI: 10.1016/j.bmc.2015.01.052
BindingDB Entry DOI: 10.7270/Q2BC417K
Phosphatidylinositol 4,5-bisphosphate 3-kinase catalytic subunit beta isoform
(Homo sapiens (Human))
BDBM50064769
(CHEMBL3401255)
Show SMILES Cc1ccc2OCCn3c(nc4cc(ccc34)[N+]([O-])=O)-c2c1
Show InChI InChI=1S/C16H13N3O3/c1-10-2-5-15-12(8-10)16-17-13-9-11(19(20)21)3-4-14(13)18(16)6-7-22-15/h2-5,8-9H,6-7H2,1H3
NCI pathway
Reactome pathway
n/an/a 184n/an/an/an/an/an/a
Nanjing University
Curated by ChEMBL
Assay Description
Inhibition of recombinant PI3Kbeta (unknown origin) using PI(3,4)P2 as substrate after 3 hrs incubation by competitive fluorescence polarization kina...
Bioorg Med Chem 23: 1231-40 (2015)
Article DOI: 10.1016/j.bmc.2015.01.052
BindingDB Entry DOI: 10.7270/Q2BC417K