BDBM50064869 CHEMBL3401277
SMILES: Cc1c(NC(=O)c2cc3CCCCc3s2)cccc1-c1cn(C)c(=O)c(Nc2ccc(cc2)C(=O)N2CCOCC2)n1
InChI Key: InChIKey=SQXIEAGPJYZIOQ-UHFFFAOYSA-N
Data: 2 IC50
Activity Spreadsheet -- Enzyme Inhibition Constant Data from BindingDB
Found 2 hits for monomerid = 50064869
Trg + Lig
Ki
nM
ΔG°
kcal/mole
IC50
nM
Kd
nM
EC50/IC50
nM
koff
s-1
kon
M-1s-1
pHTemp
°C
Tyrosine-protein kinase BTK
(Homo sapiens (Human))
BDBM50064869
(CHEMBL3401277)
Show SMILES Cc1c(NC(=O)c2cc3CCCCc3s2)cccc1-c1cn(C)c(=O)c(Nc2ccc(cc2)C(=O)N2CCOCC2)n1
Show InChI InChI=1S/C32H33N5O4S/c1-20-24(7-5-8-25(20)35-30(38)28-18-22-6-3-4-9-27(22)42-28)26-19-36(2)32(40)29(34-26)33-23-12-10-21(11-13-23)31(39)37-14-16-41-17-15-37/h5,7-8,10-13,18-19H,3-4,6,9,14-17H2,1-2H3,(H,33,34)(H,35,38)
NCI pathway
Reactome pathway
n/an/a 8n/an/an/an/an/an/a
Genentech
Curated by ChEMBL
Assay Description
Inhibition of BTK (unknown origin) by Lanthascreen method
Bioorg Med Chem Lett 25: 1333-7 (2015)
Article DOI: 10.1016/j.bmcl.2015.01.032
BindingDB Entry DOI: 10.7270/Q26Q1ZXS
Tyrosine-protein kinase BTK
(Mus musculus)
BDBM50064869
(CHEMBL3401277)
Show SMILES Cc1c(NC(=O)c2cc3CCCCc3s2)cccc1-c1cn(C)c(=O)c(Nc2ccc(cc2)C(=O)N2CCOCC2)n1
Show InChI InChI=1S/C32H33N5O4S/c1-20-24(7-5-8-25(20)35-30(38)28-18-22-6-3-4-9-27(22)42-28)26-19-36(2)32(40)29(34-26)33-23-12-10-21(11-13-23)31(39)37-14-16-41-17-15-37/h5,7-8,10-13,18-19H,3-4,6,9,14-17H2,1-2H3,(H,33,34)(H,35,38)
n/an/a 230n/an/an/an/an/an/a
Genentech
Curated by ChEMBL
Assay Description
Inhibition of BTK-mediated CD86 surface expression in Balb/c mouse splenocytes preincubated for 60 mins before F(ab')2 anti-mouse IgM measured after ...
Bioorg Med Chem Lett 25: 1333-7 (2015)
Article DOI: 10.1016/j.bmcl.2015.01.032
BindingDB Entry DOI: 10.7270/Q26Q1ZXS