BDBM50065256 CHEMBL3403835
SMILES: C[C@H](CO)Nc1cc(NS(C)(=O)=O)nc(SCc2cccc(Cl)c2F)n1
InChI Key: InChIKey=SNCCUTVKNBUBRR-SECBINFHSA-N
Data: 1 IC50
Activity Spreadsheet -- Enzyme Inhibition Constant Data from BindingDB
Found 1 hit for monomerid = 50065256
Trg + Lig
Ki
nM
ΔG°
kcal/mole
IC50
nM
Kd
nM
EC50/IC50
nM
koff
s-1
kon
M-1s-1
pHTemp
°C
C-X-C chemokine receptor type 2
(Homo sapiens (Human))
BDBM50065256
(CHEMBL3403835)
Show SMILES C[C@H](CO)Nc1cc(NS(C)(=O)=O)nc(SCc2cccc(Cl)c2F)n1 |r|
Show InChI InChI=1S/C15H18ClFN4O3S2/c1-9(7-22)18-12-6-13(21-26(2,23)24)20-15(19-12)25-8-10-4-3-5-11(16)14(10)17/h3-6,9,22H,7-8H2,1-2H3,(H2,18,19,20,21)/t9-/m1/s1
Reactome pathway
n/an/a 13n/an/an/an/an/an/a
AstraZeneca
Curated by ChEMBL
Assay Description
Displacement of [125I]IL-8 from human recombinant CXCR2 receptor expressed in HEK293 cells by scintillation counting analysis
Bioorg Med Chem Lett 25: 1616-20 (2015)
Article DOI: 10.1016/j.bmcl.2015.01.067
BindingDB Entry DOI: 10.7270/Q2F47QT4