BDBM50065284 3-[1-(4-Chloro-1H-pyrazol-3-yl)-meth-(Z)-ylidene]-1,3-dihydro-indol-2-one::CHEMBL321781::CHEMBL87402
SMILES: Clc1cn[nH]c1C=C1C(=O)Nc2ccccc12
InChI Key: InChIKey=GWLUGYITWVGWFU-UHFFFAOYSA-N
Data: 6 IC50
Activity Spreadsheet -- Enzyme Inhibition Constant Data from BindingDB
Found 6 hits for monomerid = 50065284
Trg + Lig
Ki
nM
ΔG°
kcal/mole
IC50
nM
Kd
nM
EC50/IC50
nM
koff
s-1
kon
M-1s-1
pHTemp
°C
Vascular endothelial growth factor receptor 2
(Mus musculus)
BDBM50065284
(3-[1-(4-Chloro-1H-pyrazol-3-yl)-meth-(Z)-ylidene]-...)
Show SMILES Clc1cn[nH]c1C=C1C(=O)Nc2ccccc12 |w:6.6|
Show InChI InChI=1S/C12H8ClN3O/c13-9-6-14-16-11(9)5-8-7-3-1-2-4-10(7)15-12(8)17/h1-6H,(H,14,16)(H,15,17)
Reactome pathway
n/an/a 7.41E+3n/an/an/an/an/an/a
Eli Lilly and Company
Curated by ChEMBL
Assay Description
Inhibitory activity against vascular endothelial growth factor receptor 2 (FLK1)
J Med Chem 43: 3020-32 (2000)
BindingDB Entry DOI: 10.7270/Q2HM59P2
Vascular endothelial growth factor receptor 1
(Mus musculus)
BDBM50065284
(3-[1-(4-Chloro-1H-pyrazol-3-yl)-meth-(Z)-ylidene]-...)
Show SMILES Clc1cn[nH]c1C=C1C(=O)Nc2ccccc12 |w:6.6|
Show InChI InChI=1S/C12H8ClN3O/c13-9-6-14-16-11(9)5-8-7-3-1-2-4-10(7)15-12(8)17/h1-6H,(H,14,16)(H,15,17)
Reactome pathway
n/an/a 7.41E+3n/an/an/an/an/an/a
SUGEN, Inc.
Curated by ChEMBL
Assay Description
Concentration required to achieve 50% inhibition of tyrosine phosphorylation on murine VEGF receptor (FLK-1 RTK).
J Med Chem 41: 2588-603 (1998)
Article DOI: 10.1021/jm980123i
BindingDB Entry DOI: 10.7270/Q2G73CTT
Epidermal growth factor receptor
(Homo sapiens (Human))
BDBM50065284
(3-[1-(4-Chloro-1H-pyrazol-3-yl)-meth-(Z)-ylidene]-...)
Show SMILES Clc1cn[nH]c1C=C1C(=O)Nc2ccccc12 |w:6.6|
Show InChI InChI=1S/C12H8ClN3O/c13-9-6-14-16-11(9)5-8-7-3-1-2-4-10(7)15-12(8)17/h1-6H,(H,14,16)(H,15,17)
n/an/a>1.00E+5n/an/an/an/an/an/a
SUGEN, Inc.
Curated by ChEMBL
Assay Description
Concentration required to achieve 50% inhibition of tyrosine phosphorylation on human Epidermal growth factor receptor (EGF RTK).
J Med Chem 41: 2588-603 (1998)
Article DOI: 10.1021/jm980123i
BindingDB Entry DOI: 10.7270/Q2G73CTT
Platelet-derived growth factor receptor beta
(Homo sapiens (Human))
BDBM50065284
(3-[1-(4-Chloro-1H-pyrazol-3-yl)-meth-(Z)-ylidene]-...)
Show SMILES Clc1cn[nH]c1C=C1C(=O)Nc2ccccc12 |w:6.6|
Show InChI InChI=1S/C12H8ClN3O/c13-9-6-14-16-11(9)5-8-7-3-1-2-4-10(7)15-12(8)17/h1-6H,(H,14,16)(H,15,17)
NCI pathway
Reactome pathway
n/an/a>1.00E+5n/an/an/an/an/an/a
SUGEN, Inc.
Curated by ChEMBL
Assay Description
Test concentration required to achieve 50% inhibition of tyrosine phosphorylation on human Platelet-derived growth factor receptor beta (PDGF RTK).
J Med Chem 41: 2588-603 (1998)
Article DOI: 10.1021/jm980123i
BindingDB Entry DOI: 10.7270/Q2G73CTT
Insulin-like growth factor I receptor
(Homo sapiens (Human))
BDBM50065284
(3-[1-(4-Chloro-1H-pyrazol-3-yl)-meth-(Z)-ylidene]-...)
Show SMILES Clc1cn[nH]c1C=C1C(=O)Nc2ccccc12 |w:6.6|
Show InChI InChI=1S/C12H8ClN3O/c13-9-6-14-16-11(9)5-8-7-3-1-2-4-10(7)15-12(8)17/h1-6H,(H,14,16)(H,15,17)
Reactome pathway
n/an/a>1.00E+5n/an/an/an/an/an/a
SUGEN, Inc.
Curated by ChEMBL
Assay Description
Concentration required to achieve 50% inhibition of tyrosine phosphorylation on human Insulin-like growth factor I receptor
J Med Chem 41: 2588-603 (1998)
Article DOI: 10.1021/jm980123i
BindingDB Entry DOI: 10.7270/Q2G73CTT
Receptor tyrosine-protein kinase erbB-2
(Homo sapiens (Human))
BDBM50065284
(3-[1-(4-Chloro-1H-pyrazol-3-yl)-meth-(Z)-ylidene]-...)
Show SMILES Clc1cn[nH]c1C=C1C(=O)Nc2ccccc12 |w:6.6|
Show InChI InChI=1S/C12H8ClN3O/c13-9-6-14-16-11(9)5-8-7-3-1-2-4-10(7)15-12(8)17/h1-6H,(H,14,16)(H,15,17)
n/an/a>1.00E+5n/an/an/an/an/an/a
SUGEN, Inc.
Curated by ChEMBL
Assay Description
Concentration required to achieve 50% inhibition of tyrosine phosphorylation on human Her-2 receptor tyrosine kinase (HER-2 RTK)
J Med Chem 41: 2588-603 (1998)
Article DOI: 10.1021/jm980123i
BindingDB Entry DOI: 10.7270/Q2G73CTT