BDBM50065400 (R)-N-((S)-1-Benzyl-2-oxo-ethyl)-2-methanesulfonylamino-3-thiophen-2-yl-propionamide::CHEMBL88895
SMILES: CS(=O)(=O)N[C@H](Cc1cccs1)C(=O)N[C@@H](Cc1ccccc1)C=O
InChI Key: InChIKey=MRAGOGINUXYQRY-GOEBONIOSA-N
Data: 3 KI  1 IC50
Activity Spreadsheet -- Enzyme Inhibition Constant Data from BindingDB
Found 4 hits for monomerid = 50065400
Trg + Lig
Ki
nM
ΔG°
kcal/mole
IC50
nM
Kd
nM
EC50/IC50
nM
koff
s-1
kon
M-1s-1
pHTemp
°C
Calpain1
(Homo sapiens (Human))
BDBM50065400
((R)-N-((S)-1-Benzyl-2-oxo-ethyl)-2-methanesulfonyl...)
Show SMILES CS(=O)(=O)N[C@H](Cc1cccs1)C(=O)N[C@@H](Cc1ccccc1)C=O
Show InChI InChI=1S/C17H20N2O4S2/c1-25(22,23)19-16(11-15-8-5-9-24-15)17(21)18-14(12-20)10-13-6-3-2-4-7-13/h2-9,12,14,16,19H,10-11H2,1H3,(H,18,21)/t14-,16+/m0/s1
Reactome pathway
11n/an/an/an/an/an/an/an/a
Cephalon, Inc.
Curated by ChEMBL
Assay Description
Inhibitory activity against recombinant human Calpain-I receptor
J Med Chem 41: 2663-6 (1998)
Article DOI: 10.1021/jm980035y
BindingDB Entry DOI: 10.7270/Q2S46SNF
Calpain-2 (m-Calpain)
(Homo sapiens (Human))
BDBM50065400
((R)-N-((S)-1-Benzyl-2-oxo-ethyl)-2-methanesulfonyl...)
Show SMILES CS(=O)(=O)N[C@H](Cc1cccs1)C(=O)N[C@@H](Cc1ccccc1)C=O
Show InChI InChI=1S/C17H20N2O4S2/c1-25(22,23)19-16(11-15-8-5-9-24-15)17(21)18-14(12-20)10-13-6-3-2-4-7-13/h2-9,12,14,16,19H,10-11H2,1H3,(H,18,21)/t14-,16+/m0/s1
11n/an/an/an/an/an/an/an/a
Cephalon, Inc.
Curated by ChEMBL
Assay Description
Inhibitory activity against Calpain-II receptor in porcine kidney
J Med Chem 41: 2663-6 (1998)
Article DOI: 10.1021/jm980035y
BindingDB Entry DOI: 10.7270/Q2S46SNF
Cathepsin B
(Homo sapiens (Human))
BDBM50065400
((R)-N-((S)-1-Benzyl-2-oxo-ethyl)-2-methanesulfonyl...)
Show SMILES CS(=O)(=O)N[C@H](Cc1cccs1)C(=O)N[C@@H](Cc1ccccc1)C=O
Show InChI InChI=1S/C17H20N2O4S2/c1-25(22,23)19-16(11-15-8-5-9-24-15)17(21)18-14(12-20)10-13-6-3-2-4-7-13/h2-9,12,14,16,19H,10-11H2,1H3,(H,18,21)/t14-,16+/m0/s1
Reactome pathway
23n/an/an/an/an/an/an/an/a
Cephalon, Inc.
Curated by ChEMBL
Assay Description
Inhibitory activity against cathepsin B receptor in human liver
J Med Chem 41: 2663-6 (1998)
Article DOI: 10.1021/jm980035y
BindingDB Entry DOI: 10.7270/Q2S46SNF
Calpain1
(Homo sapiens (Human))
BDBM50065400
((R)-N-((S)-1-Benzyl-2-oxo-ethyl)-2-methanesulfonyl...)
Show SMILES CS(=O)(=O)N[C@H](Cc1cccs1)C(=O)N[C@@H](Cc1ccccc1)C=O
Show InChI InChI=1S/C17H20N2O4S2/c1-25(22,23)19-16(11-15-8-5-9-24-15)17(21)18-14(12-20)10-13-6-3-2-4-7-13/h2-9,12,14,16,19H,10-11H2,1H3,(H,18,21)/t14-,16+/m0/s1
Reactome pathway
n/an/a 300n/an/an/an/an/an/a
Cephalon, Inc.
Curated by ChEMBL
Assay Description
Inhibition of intracellular Calpain-I receptor using intact cell assay system
J Med Chem 41: 2663-6 (1998)
Article DOI: 10.1021/jm980035y
BindingDB Entry DOI: 10.7270/Q2S46SNF