BDBM50065403 (R)-N-((S)-1-Benzyl-2-oxo-ethyl)-2-methanesulfonylamino-3-phenyl-propionamide::CHEMBL88646
SMILES: CS(=O)(=O)N[C@H](Cc1ccccc1)C(=O)N[C@@H](Cc1ccccc1)C=O
InChI Key: InChIKey=XJPDKOSJXFJJJW-ZWKOTPCHSA-N
Data: 3 KI  1 IC50
Activity Spreadsheet -- Enzyme Inhibition Constant Data from BindingDB
Found 4 hits for monomerid = 50065403
Trg + Lig
Ki
nM
ΔG°
kcal/mole
IC50
nM
Kd
nM
EC50/IC50
nM
koff
s-1
kon
M-1s-1
pHTemp
°C
Calpain1
(Homo sapiens (Human))
BDBM50065403
((R)-N-((S)-1-Benzyl-2-oxo-ethyl)-2-methanesulfonyl...)
Show SMILES CS(=O)(=O)N[C@H](Cc1ccccc1)C(=O)N[C@@H](Cc1ccccc1)C=O
Show InChI InChI=1S/C19H22N2O4S/c1-26(24,25)21-18(13-16-10-6-3-7-11-16)19(23)20-17(14-22)12-15-8-4-2-5-9-15/h2-11,14,17-18,21H,12-13H2,1H3,(H,20,23)/t17-,18+/m0/s1
Reactome pathway
11n/an/an/an/an/an/an/an/a
Cephalon, Inc.
Curated by ChEMBL
Assay Description
Inhibitory activity against recombinant human Calpain-I receptor
J Med Chem 41: 2663-6 (1998)
Article DOI: 10.1021/jm980035y
BindingDB Entry DOI: 10.7270/Q2S46SNF
Calpain-2 (m-Calpain)
(Homo sapiens (Human))
BDBM50065403
((R)-N-((S)-1-Benzyl-2-oxo-ethyl)-2-methanesulfonyl...)
Show SMILES CS(=O)(=O)N[C@H](Cc1ccccc1)C(=O)N[C@@H](Cc1ccccc1)C=O
Show InChI InChI=1S/C19H22N2O4S/c1-26(24,25)21-18(13-16-10-6-3-7-11-16)19(23)20-17(14-22)12-15-8-4-2-5-9-15/h2-11,14,17-18,21H,12-13H2,1H3,(H,20,23)/t17-,18+/m0/s1
13n/an/an/an/an/an/an/an/a
Cephalon, Inc.
Curated by ChEMBL
Assay Description
Inhibitory activity against Calpain-II receptor in porcine kidney
J Med Chem 41: 2663-6 (1998)
Article DOI: 10.1021/jm980035y
BindingDB Entry DOI: 10.7270/Q2S46SNF
Cathepsin B
(Homo sapiens (Human))
BDBM50065403
((R)-N-((S)-1-Benzyl-2-oxo-ethyl)-2-methanesulfonyl...)
Show SMILES CS(=O)(=O)N[C@H](Cc1ccccc1)C(=O)N[C@@H](Cc1ccccc1)C=O
Show InChI InChI=1S/C19H22N2O4S/c1-26(24,25)21-18(13-16-10-6-3-7-11-16)19(23)20-17(14-22)12-15-8-4-2-5-9-15/h2-11,14,17-18,21H,12-13H2,1H3,(H,20,23)/t17-,18+/m0/s1
Reactome pathway
120n/an/an/an/an/an/an/an/a
Cephalon, Inc.
Curated by ChEMBL
Assay Description
Inhibitory activity against cathepsin B receptor in human liver
J Med Chem 41: 2663-6 (1998)
Article DOI: 10.1021/jm980035y
BindingDB Entry DOI: 10.7270/Q2S46SNF
Calpain1
(Homo sapiens (Human))
BDBM50065403
((R)-N-((S)-1-Benzyl-2-oxo-ethyl)-2-methanesulfonyl...)
Show SMILES CS(=O)(=O)N[C@H](Cc1ccccc1)C(=O)N[C@@H](Cc1ccccc1)C=O
Show InChI InChI=1S/C19H22N2O4S/c1-26(24,25)21-18(13-16-10-6-3-7-11-16)19(23)20-17(14-22)12-15-8-4-2-5-9-15/h2-11,14,17-18,21H,12-13H2,1H3,(H,20,23)/t17-,18+/m0/s1
Reactome pathway
n/an/a 600n/an/an/an/an/an/a
Cephalon, Inc.
Curated by ChEMBL
Assay Description
Inhibition of intracellular Calpain-I receptor using intact cell assay system
J Med Chem 41: 2663-6 (1998)
Article DOI: 10.1021/jm980035y
BindingDB Entry DOI: 10.7270/Q2S46SNF