BDBM50065504 CHEMBL3402746
SMILES: Cc1nc(no1)-c1cccc(Cn2nc(ccc2=O)-c2cc(F)cc(F)c2)c1
InChI Key: InChIKey=COKUAUZQPFYSDO-UHFFFAOYSA-N
Data: 1 IC50
Activity Spreadsheet -- Enzyme Inhibition Constant Data from BindingDB
Found 1 hit for monomerid = 50065504
Trg + Lig
Ki
nM
ΔG°
kcal/mole
IC50
nM
Kd
nM
EC50/IC50
nM
koff
s-1
kon
M-1s-1
pHTemp
°C
Hepatocyte growth factor receptor
(Homo sapiens (Human))
BDBM50065504
(CHEMBL3402746)
Show SMILES Cc1nc(no1)-c1cccc(Cn2nc(ccc2=O)-c2cc(F)cc(F)c2)c1
Show InChI InChI=1S/C20H14F2N4O2/c1-12-23-20(25-28-12)14-4-2-3-13(7-14)11-26-19(27)6-5-18(24-26)15-8-16(21)10-17(22)9-15/h2-10H,11H2,1H3
n/an/a 800n/an/an/an/an/an/a
Merck Serono Research& Development
Curated by ChEMBL
Assay Description
Inhibition of GST-His6-tagged recombinant human c-Met kinase domain (956 to 1390) after 60 mins by anoff-chip mobility shift assay
Bioorg Med Chem Lett 25: 1597-602 (2015)
Article DOI: 10.1016/j.bmcl.2015.02.002
BindingDB Entry DOI: 10.7270/Q2HX1FBT