BDBM50065519 CHEMBL3401376
SMILES: CCC(CC)CC1(O)CCN(CC1)C(=O)Nc1cc(C)cc(Oc2ccc(F)cc2)c1
InChI Key: InChIKey=CKKDVWOWAWTQRP-UHFFFAOYSA-N
Data: 2 IC50
Activity Spreadsheet -- Enzyme Inhibition Constant Data from BindingDB
Found 2 hits for monomerid = 50065519
Trg + Lig
Ki
nM
ΔG°
kcal/mole
IC50
nM
Kd
nM
EC50/IC50
nM
koff
s-1
kon
M-1s-1
pHTemp
°C
Sphingosine 1-phosphate receptor 2
(Homo sapiens (Human))
BDBM50065519
(CHEMBL3401376)
Show SMILES CCC(CC)CC1(O)CCN(CC1)C(=O)Nc1cc(C)cc(Oc2ccc(F)cc2)c1
Show InChI InChI=1S/C25H33FN2O3/c1-4-19(5-2)17-25(30)10-12-28(13-11-25)24(29)27-21-14-18(3)15-23(16-21)31-22-8-6-20(26)7-9-22/h6-9,14-16,19,30H,4-5,10-13,17H2,1-3H3,(H,27,29)
NCI pathway
Reactome pathway
n/an/a 500n/an/an/an/an/an/a
Ono Pharmaceutical Co.
Curated by ChEMBL
Assay Description
Displacement of [33P]-S1P from human S1P2 receptor expressed in CHOK1 cells after 60 mins by scintillation counting analysis
Bioorg Med Chem Lett 25: 1479-82 (2015)
Article DOI: 10.1016/j.bmcl.2015.02.029
BindingDB Entry DOI: 10.7270/Q2D79D3G
Sphingosine 1-phosphate receptor 2
(Homo sapiens (Human))
BDBM50065519
(CHEMBL3401376)
Show SMILES CCC(CC)CC1(O)CCN(CC1)C(=O)Nc1cc(C)cc(Oc2ccc(F)cc2)c1
Show InChI InChI=1S/C25H33FN2O3/c1-4-19(5-2)17-25(30)10-12-28(13-11-25)24(29)27-21-14-18(3)15-23(16-21)31-22-8-6-20(26)7-9-22/h6-9,14-16,19,30H,4-5,10-13,17H2,1-3H3,(H,27,29)
NCI pathway
Reactome pathway
n/an/a 500n/an/an/an/an/an/a
Ono Pharmaceutical Co.
Curated by ChEMBL
Assay Description
Antagonist activity at human S1P2 receptor overexpressed in CHO cells assessed as increase in intracellular calcium ion concentration incubated 3 min...
Bioorg Med Chem Lett 25: 1479-82 (2015)
Article DOI: 10.1016/j.bmcl.2015.02.029
BindingDB Entry DOI: 10.7270/Q2D79D3G