BDBM50065605 CHEMBL3401378
SMILES: CCOc1cc(NC(=O)N2CCC(O)(CC(CC)CC)CC2)cc(Oc2ccc(F)cc2)c1
InChI Key: InChIKey=KGTVMJWJRLDBFD-UHFFFAOYSA-N
Data: 2 IC50
Activity Spreadsheet -- Enzyme Inhibition Constant Data from BindingDB
Found 2 hits for monomerid = 50065605
Trg + Lig
Ki
nM
ΔG°
kcal/mole
IC50
nM
Kd
nM
EC50/IC50
nM
koff
s-1
kon
M-1s-1
pHTemp
°C
Sphingosine 1-phosphate receptor 2
(Homo sapiens (Human))
BDBM50065605
(CHEMBL3401378)
Show SMILES CCOc1cc(NC(=O)N2CCC(O)(CC(CC)CC)CC2)cc(Oc2ccc(F)cc2)c1
Show InChI InChI=1S/C26H35FN2O4/c1-4-19(5-2)18-26(31)11-13-29(14-12-26)25(30)28-21-15-23(32-6-3)17-24(16-21)33-22-9-7-20(27)8-10-22/h7-10,15-17,19,31H,4-6,11-14,18H2,1-3H3,(H,28,30)
NCI pathway
Reactome pathway
n/an/a 1.40E+3n/an/an/an/an/an/a
Ono Pharmaceutical Co.
Curated by ChEMBL
Assay Description
Displacement of [33P]-S1P from human S1P2 receptor expressed in CHOK1 cells after 60 mins by scintillation counting analysis
Bioorg Med Chem Lett 25: 1479-82 (2015)
Article DOI: 10.1016/j.bmcl.2015.02.029
BindingDB Entry DOI: 10.7270/Q2D79D3G
Sphingosine 1-phosphate receptor 2
(Homo sapiens (Human))
BDBM50065605
(CHEMBL3401378)
Show SMILES CCOc1cc(NC(=O)N2CCC(O)(CC(CC)CC)CC2)cc(Oc2ccc(F)cc2)c1
Show InChI InChI=1S/C26H35FN2O4/c1-4-19(5-2)18-26(31)11-13-29(14-12-26)25(30)28-21-15-23(32-6-3)17-24(16-21)33-22-9-7-20(27)8-10-22/h7-10,15-17,19,31H,4-6,11-14,18H2,1-3H3,(H,28,30)
NCI pathway
Reactome pathway
n/an/a 1.40E+3n/an/an/an/an/an/a
Ono Pharmaceutical Co.
Curated by ChEMBL
Assay Description
Antagonist activity at human S1P2 receptor overexpressed in CHO cells assessed as increase in intracellular calcium ion concentration incubated 3 min...
Bioorg Med Chem Lett 25: 1479-82 (2015)
Article DOI: 10.1016/j.bmcl.2015.02.029
BindingDB Entry DOI: 10.7270/Q2D79D3G