BDBM50065871 (2S,3S)-2-Benzyl-3-ethyl-4-oxo-azetidine-1-carboxylic acid (pyridin-4-ylmethyl)-amide::CHEMBL319173
SMILES: CC[C@H]1[C@H](Cc2ccccc2)N(C(=O)NCc2ccncc2)C1=O
InChI Key: InChIKey=CMVUTFNKCAIDRF-IRXDYDNUSA-N
Data: 3 IC50
Activity Spreadsheet -- Enzyme Inhibition Constant Data from BindingDB
Found 3 hits for monomerid = 50065871
Trg + Lig
Ki
nM
ΔG°
kcal/mole
IC50
nM
Kd
nM
EC50/IC50
nM
koff
s-1
kon
M-1s-1
pHTemp
°C
Human rhinovirus A protease
(Human rhinovirus B)
BDBM50065871
((2S,3S)-2-Benzyl-3-ethyl-4-oxo-azetidine-1-carboxy...)
Show SMILES CC[C@H]1[C@H](Cc2ccccc2)N(C(=O)NCc2ccncc2)C1=O
Show InChI InChI=1S/C19H21N3O2/c1-2-16-17(12-14-6-4-3-5-7-14)22(18(16)23)19(24)21-13-15-8-10-20-11-9-15/h3-11,16-17H,2,12-13H2,1H3,(H,21,24)/t16-,17-/m0/s1
n/an/a 6.00E+4n/an/an/an/an/an/a
Boehringer Ingelheim (Canada) Ltd.
Curated by ChEMBL
Assay Description
Inhibitory activity against human cytomegalovirus (HCMV) protease
J Med Chem 41: 2882-91 (1998)
Article DOI: 10.1021/jm980131z
BindingDB Entry DOI: 10.7270/Q2X63M2J
Alpha-chymotrypsin
(Bos taurus (bovine))
BDBM50065871
((2S,3S)-2-Benzyl-3-ethyl-4-oxo-azetidine-1-carboxy...)
Show SMILES CC[C@H]1[C@H](Cc2ccccc2)N(C(=O)NCc2ccncc2)C1=O
Show InChI InChI=1S/C19H21N3O2/c1-2-16-17(12-14-6-4-3-5-7-14)22(18(16)23)19(24)21-13-15-8-10-20-11-9-15/h3-11,16-17H,2,12-13H2,1H3,(H,21,24)/t16-,17-/m0/s1
Reactome pathway
n/an/a 1.90E+4n/an/an/an/an/an/a
Boehringer Ingelheim (Canada) Ltd.
Curated by ChEMBL
Assay Description
Compound was tested for its activity against bovine pancreatic Alpha-chymotrypsin (BPC)
J Med Chem 41: 2882-91 (1998)
Article DOI: 10.1021/jm980131z
BindingDB Entry DOI: 10.7270/Q2X63M2J
Leukocyte elastase
(Homo sapiens (Human))
BDBM50065871
((2S,3S)-2-Benzyl-3-ethyl-4-oxo-azetidine-1-carboxy...)
Show SMILES CC[C@H]1[C@H](Cc2ccccc2)N(C(=O)NCc2ccncc2)C1=O
Show InChI InChI=1S/C19H21N3O2/c1-2-16-17(12-14-6-4-3-5-7-14)22(18(16)23)19(24)21-13-15-8-10-20-11-9-15/h3-11,16-17H,2,12-13H2,1H3,(H,21,24)/t16-,17-/m0/s1
Reactome pathway
n/an/a 1.20E+3n/an/an/an/an/an/a
Boehringer Ingelheim (Canada) Ltd.
Curated by ChEMBL
Assay Description
Compound was tested for its activity against human leukocyte elastase(HLE)
J Med Chem 41: 2882-91 (1998)
Article DOI: 10.1021/jm980131z
BindingDB Entry DOI: 10.7270/Q2X63M2J