BDBM50066146 CHEMBL3403010
SMILES: CN(C(=O)c1ccccc1)c1ccc2[nH]c(cc2n1)-c1n[nH]c2ccccc12
InChI Key: InChIKey=CRPVIDJZMQAHEI-UHFFFAOYSA-N
Data: 1 IC50
Activity Spreadsheet -- Enzyme Inhibition Constant Data from BindingDB
Found 1 hit for monomerid = 50066146
Trg + Lig
Ki
nM
ΔG°
kcal/mole
IC50
nM
Kd
nM
EC50/IC50
nM
koff
s-1
kon
M-1s-1
pHTemp
°C
Aurora kinase A
(Homo sapiens (Human))
BDBM50066146
(CHEMBL3403010)
Show SMILES CN(C(=O)c1ccccc1)c1ccc2[nH]c(cc2n1)-c1n[nH]c2ccccc12
Show InChI InChI=1S/C22H17N5O/c1-27(22(28)14-7-3-2-4-8-14)20-12-11-17-18(24-20)13-19(23-17)21-15-9-5-6-10-16(15)25-26-21/h2-13,23H,1H3,(H,25,26)
NCI pathway
Reactome pathway
n/an/a 32n/an/an/an/an/an/a
Zhejiang University
Curated by ChEMBL
Assay Description
Inhibition of human full length Aurora A by HTRF assay
Bioorg Med Chem 23: 1858-68 (2015)
Article DOI: 10.1016/j.bmc.2015.02.004
BindingDB Entry DOI: 10.7270/Q26H4K23