BDBM50066170 (S)-1-(2-Chloro-benzylthiocarbamoyl)-pyrrolidine-2-carboxylic acid [(S)-1-(benzyl-methyl-carbamoyl)-2-naphthalen-2-yl-ethyl]-amide::CHEMBL106078
SMILES: CN(Cc1ccccc1)C(=O)[C@H](Cc1ccc2ccccc2c1)NC(=O)[C@@H]1CCCN1C(=S)NCc1ccccc1Cl
InChI Key: InChIKey=VKBUMNWFBCDRMF-CONSDPRKSA-N
Data: 1 KI
Activity Spreadsheet -- Enzyme Inhibition Constant Data from BindingDB
Found 1 hit for monomerid = 50066170
Trg + Lig
Ki
nM
ΔG°
kcal/mole
IC50
nM
Kd
nM
EC50/IC50
nM
koff
s-1
kon
M-1s-1
pHTemp
°C
Substance-P receptor
(Homo sapiens (Human))
BDBM50066170
((S)-1-(2-Chloro-benzylthiocarbamoyl)-pyrrolidine-2...)
Show SMILES CN(Cc1ccccc1)C(=O)[C@H](Cc1ccc2ccccc2c1)NC(=O)[C@@H]1CCCN1C(=S)NCc1ccccc1Cl
Show InChI InChI=1S/C34H35ClN4O2S/c1-38(23-24-10-3-2-4-11-24)33(41)30(21-25-17-18-26-12-5-6-13-27(26)20-25)37-32(40)31-16-9-19-39(31)34(42)36-22-28-14-7-8-15-29(28)35/h2-8,10-15,17-18,20,30-31H,9,16,19,21-23H2,1H3,(H,36,42)(H,37,40)/t30-,31-/m0/s1
Reactome pathway
0.700n/an/an/an/an/an/an/an/a
Novartis Institute for Medical Sciences
Curated by ChEMBL
Assay Description
In vitro binding affinity towards Tachykinin receptor 1 by measuring its ability to displace [3H]SP (0.6 nM) binding to membranes from Cos-7 cells tr...
J Med Chem 41: 3159-73 (1998)
Article DOI: 10.1021/jm970499g
BindingDB Entry DOI: 10.7270/Q2BZ66QJ