BDBM50066176 (S)-1-(2,6-Dichloro-benzylthiocarbamoyl)-pyrrolidine-2-carboxylic acid [(S)-1-(benzyl-methyl-carbamoyl)-2-phenyl-ethyl]-amide::CHEMBL326893
SMILES: CN(Cc1ccccc1)C(=O)[C@H](Cc1ccccc1)NC(=O)[C@@H]1CCCN1C(=S)NCc1c(Cl)cccc1Cl
InChI Key: InChIKey=AYDCRUURSWKYHM-SVBPBHIXSA-N
Data: 1 KI
Activity Spreadsheet -- Enzyme Inhibition Constant Data from BindingDB
Found 1 hit for monomerid = 50066176
Trg + Lig
Ki
nM
ΔG°
kcal/mole
IC50
nM
Kd
nM
EC50/IC50
nM
koff
s-1
kon
M-1s-1
pHTemp
°C
Substance-P receptor
(Homo sapiens (Human))
BDBM50066176
((S)-1-(2,6-Dichloro-benzylthiocarbamoyl)-pyrrolidi...)
Show SMILES CN(Cc1ccccc1)C(=O)[C@H](Cc1ccccc1)NC(=O)[C@@H]1CCCN1C(=S)NCc1c(Cl)cccc1Cl
Show InChI InChI=1S/C30H32Cl2N4O2S/c1-35(20-22-12-6-3-7-13-22)29(38)26(18-21-10-4-2-5-11-21)34-28(37)27-16-9-17-36(27)30(39)33-19-23-24(31)14-8-15-25(23)32/h2-8,10-15,26-27H,9,16-20H2,1H3,(H,33,39)(H,34,37)/t26-,27-/m0/s1
Reactome pathway
26n/an/an/an/an/an/an/an/a
Novartis Institute for Medical Sciences
Curated by ChEMBL
Assay Description
In vitro binding affinity towards Tachykinin receptor 1 by measuring its ability to displace [3H]SP (0.6 nM) binding to membranes from Cos-7 cells tr...
J Med Chem 41: 3159-73 (1998)
Article DOI: 10.1021/jm970499g
BindingDB Entry DOI: 10.7270/Q2BZ66QJ