BDBM50066193 (S)-Pyrrolidine-1,2-dicarboxylic acid 2-{[(S)-1-(benzyl-methyl-carbamoyl)-2-naphthalen-2-yl-ethyl]-amide} 1-[(2-methoxymethyl-phenyl)-amide]::CHEMBL111295
SMILES: COCc1ccccc1NC(=O)N1CCC[C@H]1C(=O)N[C@@H](Cc1ccc2ccccc2c1)C(=O)N(C)Cc1ccccc1
InChI Key: InChIKey=UOBYZCNFWMDVTC-ACHIHNKUSA-N
Data: 1 KI  1 IC50
Activity Spreadsheet -- Enzyme Inhibition Constant Data from BindingDB
Found 2 hits for monomerid = 50066193
Trg + Lig
Ki
nM
ΔG°
kcal/mole
IC50
nM
Kd
nM
EC50/IC50
nM
koff
s-1
kon
M-1s-1
pHTemp
°C
Substance-P receptor
(Homo sapiens (Human))
BDBM50066193
((S)-Pyrrolidine-1,2-dicarboxylic acid 2-{[(S)-1-(b...)
Show SMILES COCc1ccccc1NC(=O)N1CCC[C@H]1C(=O)N[C@@H](Cc1ccc2ccccc2c1)C(=O)N(C)Cc1ccccc1
Show InChI InChI=1S/C35H38N4O4/c1-38(23-25-11-4-3-5-12-25)34(41)31(22-26-18-19-27-13-6-7-14-28(27)21-26)36-33(40)32-17-10-20-39(32)35(42)37-30-16-9-8-15-29(30)24-43-2/h3-9,11-16,18-19,21,31-32H,10,17,20,22-24H2,1-2H3,(H,36,40)(H,37,42)/t31-,32-/m0/s1
Reactome pathway
1n/an/an/an/an/an/an/an/a
Novartis Institute for Medical Sciences
Curated by ChEMBL
Assay Description
In vitro binding affinity towards Tachykinin receptor 1 by measuring its ability to displace [3H]SP (0.6 nM) binding to membranes from Cos-7 cells tr...
J Med Chem 41: 3159-73 (1998)
Article DOI: 10.1021/jm970499g
BindingDB Entry DOI: 10.7270/Q2BZ66QJ
Substance-P receptor
(GUINEA PIG)
BDBM50066193
((S)-Pyrrolidine-1,2-dicarboxylic acid 2-{[(S)-1-(b...)
Show SMILES COCc1ccccc1NC(=O)N1CCC[C@H]1C(=O)N[C@@H](Cc1ccc2ccccc2c1)C(=O)N(C)Cc1ccccc1
Show InChI InChI=1S/C35H38N4O4/c1-38(23-25-11-4-3-5-12-25)34(41)31(22-26-18-19-27-13-6-7-14-28(27)21-26)36-33(40)32-17-10-20-39(32)35(42)37-30-16-9-8-15-29(30)24-43-2/h3-9,11-16,18-19,21,31-32H,10,17,20,22-24H2,1-2H3,(H,36,40)(H,37,42)/t31-,32-/m0/s1
n/an/a 1.20n/an/an/an/an/an/a
Novartis Institute for Medical Sciences
Curated by ChEMBL
Assay Description
Tachykinin receptor 1 agonistic activity as inhibition of contractions evoked by 4 nM [Sar9,Met(O2)11]-SP in guinea pig ileum
J Med Chem 41: 3159-73 (1998)
Article DOI: 10.1021/jm970499g
BindingDB Entry DOI: 10.7270/Q2BZ66QJ