BDBM50066202 (S)-Pyrrolidine-1,2-dicarboxylic acid 2-{[(S)-1-(benzyl-methyl-carbamoyl)-2-naphthalen-2-yl-ethyl]-amide} 1-[(2-dimethylcarbamoyl-phenyl)-amide]::CHEMBL320758
SMILES: CN(C)C(=O)c1ccccc1NC(=O)N1CCC[C@H]1C(=O)N[C@@H](Cc1ccc2ccccc2c1)C(=O)N(C)Cc1ccccc1
InChI Key: InChIKey=DSNJUUKGQCMCOQ-ACHIHNKUSA-N
Data: 1 KI
Activity Spreadsheet -- Enzyme Inhibition Constant Data from BindingDB
Found 1 hit for monomerid = 50066202
Trg + Lig
Ki
nM
ΔG°
kcal/mole
IC50
nM
Kd
nM
EC50/IC50
nM
koff
s-1
kon
M-1s-1
pHTemp
°C
Substance-P receptor
(Homo sapiens (Human))
BDBM50066202
((S)-Pyrrolidine-1,2-dicarboxylic acid 2-{[(S)-1-(b...)
Show SMILES CN(C)C(=O)c1ccccc1NC(=O)N1CCC[C@H]1C(=O)N[C@@H](Cc1ccc2ccccc2c1)C(=O)N(C)Cc1ccccc1
Show InChI InChI=1S/C36H39N5O4/c1-39(2)34(43)29-16-9-10-17-30(29)38-36(45)41-21-11-18-32(41)33(42)37-31(35(44)40(3)24-25-12-5-4-6-13-25)23-26-19-20-27-14-7-8-15-28(27)22-26/h4-10,12-17,19-20,22,31-32H,11,18,21,23-24H2,1-3H3,(H,37,42)(H,38,45)/t31-,32-/m0/s1
Reactome pathway
6.10n/an/an/an/an/an/an/an/a
Novartis Institute for Medical Sciences
Curated by ChEMBL
Assay Description
In vitro binding affinity towards Tachykinin receptor 1 by measuring its ability to displace [3H]SP (0.6 nM) binding to membranes from Cos-7 cells tr...
J Med Chem 41: 3159-73 (1998)
Article DOI: 10.1021/jm970499g
BindingDB Entry DOI: 10.7270/Q2BZ66QJ