BDBM50066366 CHEMBL3401592
SMILES: Fc1cc(cc(c1)S(=O)(=O)c1sc2ncccc2c1-c1ccc(Cl)cc1)C#N
InChI Key: InChIKey=UYVOZUXHKOMLBE-UHFFFAOYSA-N
Data: 1 KI  1 IC50
Activity Spreadsheet -- Enzyme Inhibition Constant Data from BindingDB
Found 2 hits for monomerid = 50066366
Trg + Lig
Ki
nM
ΔG°
kcal/mole
IC50
nM
Kd
nM
EC50/IC50
nM
koff
s-1
kon
M-1s-1
pHTemp
°C
Metabotropic glutamate receptor
(Rattus norvegicus (Rat))
BDBM50066366
(CHEMBL3401592)
Show SMILES Fc1cc(cc(c1)S(=O)(=O)c1sc2ncccc2c1-c1ccc(Cl)cc1)C#N
Show InChI InChI=1S/C20H10ClFN2O2S2/c21-14-5-3-13(4-6-14)18-17-2-1-7-24-19(17)27-20(18)28(25,26)16-9-12(11-23)8-15(22)10-16/h1-10H
Reactome pathway
2n/an/an/an/an/an/an/an/a
Gedeon Richter Plc
Curated by ChEMBL
Assay Description
Displacement of [3H]-M-MPEP from rat cerebrocortical mGluR5 receptor
Bioorg Med Chem Lett 25: 1724-9 (2015)
Article DOI: 10.1016/j.bmcl.2015.02.073
BindingDB Entry DOI: 10.7270/Q2JS9S47
Metabotropic glutamate receptor
(Rattus norvegicus (Rat))
BDBM50066366
(CHEMBL3401592)
Show SMILES Fc1cc(cc(c1)S(=O)(=O)c1sc2ncccc2c1-c1ccc(Cl)cc1)C#N
Show InChI InChI=1S/C20H10ClFN2O2S2/c21-14-5-3-13(4-6-14)18-17-2-1-7-24-19(17)27-20(18)28(25,26)16-9-12(11-23)8-15(22)10-16/h1-10H
Reactome pathway
n/an/a 18n/an/an/an/an/an/a
Gedeon Richter Plc
Curated by ChEMBL
Assay Description
Negative allosteric modulation of mGlu5 receptor in primary E17 rat embryo neuron assessed as ca2+ level by fluo-4/AM assay
Bioorg Med Chem Lett 25: 1724-9 (2015)
Article DOI: 10.1016/j.bmcl.2015.02.073
BindingDB Entry DOI: 10.7270/Q2JS9S47