BDBM50066427 CHEMBL109210::N,N'-Bis-(4-butyl-phenyl)-guanidine
SMILES: CCCCc1ccc(NC(N)=Nc2ccc(CCCC)cc2)cc1
InChI Key: InChIKey=XDEXLYGQRYSUON-UHFFFAOYSA-N
Data: 1 IC50
Activity Spreadsheet -- Enzyme Inhibition Constant Data from BindingDB
Found 1 hit for monomerid = 50066427
Trg + Lig
Ki
nM
ΔG°
kcal/mole
IC50
nM
Kd
nM
EC50/IC50
nM
koff
s-1
kon
M-1s-1
pHTemp
°C
Sodium channel protein type II alpha subunit
(Rattus norvegicus)
BDBM50066427
(CHEMBL109210 | N,N'-Bis-(4-butyl-phenyl)-guanidine)
Show SMILES CCCCc1ccc(NC(N)=Nc2ccc(CCCC)cc2)cc1 |w:11.11|
Show InChI InChI=1S/C21H29N3/c1-3-5-7-17-9-13-19(14-10-17)23-21(22)24-20-15-11-18(12-16-20)8-6-4-2/h9-16H,3-8H2,1-2H3,(H3,22,23,24)
n/an/a 130n/an/an/an/an/an/a
Cambridge NeuroScience, Inc.
Curated by ChEMBL
Assay Description
Sodium channel block, determined by % block of [14C]guanidinium flux in CHO line expressing rat type IIA sodium channels derived from rat brain
J Med Chem 41: 3298-302 (1998)
Article DOI: 10.1021/jm980134b
BindingDB Entry DOI: 10.7270/Q2Q52Q8W