BDBM50066796 CHEMBL3400536
SMILES: CCc1c([nH]c2ccc(Cl)cc12)C(=O)NCCc1cccc(c1)N(C)C
InChI Key: InChIKey=NDVLYTTXLWSSNJ-UHFFFAOYSA-N
Data: 1 IC50
Activity Spreadsheet -- Enzyme Inhibition Constant Data from BindingDB
Found 1 hit for monomerid = 50066796
Trg + Lig
Ki
nM
ΔG°
kcal/mole
IC50
nM
Kd
nM
EC50/IC50
nM
koff
s-1
kon
M-1s-1
pHTemp
°C
Cannabinoid receptor 1
(Homo sapiens (Human))
BDBM50066796
(CHEMBL3400536)
Show SMILES CCc1c([nH]c2ccc(Cl)cc12)C(=O)NCCc1cccc(c1)N(C)C
Show InChI InChI=1S/C21H24ClN3O/c1-4-17-18-13-15(22)8-9-19(18)24-20(17)21(26)23-11-10-14-6-5-7-16(12-14)25(2)3/h5-9,12-13,24H,4,10-11H2,1-3H3,(H,23,26)
NCI pathway
Reactome pathway
n/an/a>1.00E+4n/an/an/an/an/an/a
Research Triangle Institute
Curated by ChEMBL
Assay Description
Antagonist activity at human CB1 receptor expressed in CHO-RD-HGA16 cells assessed as inhibition of CP55940-induced calcium mobilization incubated fo...
Bioorg Med Chem 23: 2195-203 (2015)
Article DOI: 10.1016/j.bmc.2015.02.058
BindingDB Entry DOI: 10.7270/Q29888PG