BDBM50066802 CHEMBL3400542
SMILES: CCc1c([nH]c2ccc(Cl)cc12)C(=O)NCCc1ccc(cc1)C(C)(C)C
InChI Key: InChIKey=KTTLGOGMSCBATB-UHFFFAOYSA-N
Data: 1 IC50
Activity Spreadsheet -- Enzyme Inhibition Constant Data from BindingDB
Found 1 hit for monomerid = 50066802
Trg + Lig
Ki
nM
ΔG°
kcal/mole
IC50
nM
Kd
nM
EC50/IC50
nM
koff
s-1
kon
M-1s-1
pHTemp
°C
Cannabinoid receptor 1
(Homo sapiens (Human))
BDBM50066802
(CHEMBL3400542)
Show SMILES CCc1c([nH]c2ccc(Cl)cc12)C(=O)NCCc1ccc(cc1)C(C)(C)C
Show InChI InChI=1S/C23H27ClN2O/c1-5-18-19-14-17(24)10-11-20(19)26-21(18)22(27)25-13-12-15-6-8-16(9-7-15)23(2,3)4/h6-11,14,26H,5,12-13H2,1-4H3,(H,25,27)
NCI pathway
Reactome pathway
n/an/a 2.43E+3n/an/an/an/an/an/a
Research Triangle Institute
Curated by ChEMBL
Assay Description
Antagonist activity at human CB1 receptor expressed in CHO-RD-HGA16 cells assessed as inhibition of CP55940-induced calcium mobilization incubated fo...
Bioorg Med Chem 23: 2195-203 (2015)
Article DOI: 10.1016/j.bmc.2015.02.058
BindingDB Entry DOI: 10.7270/Q29888PG