BDBM50066899 (2E,4E,6E)-7-(4,4-Dimethyl-chroman-6-yl)-3-methyl-octa-2,4,6-trienoic acid::7-(4,4-Dimethyl-chroman-6-yl)-3-methyl-octa-2,4,6-trienoic acid::CHEMBL35136
SMILES: C\C(\C=C\C=C(/C)c1ccc2OCCC(C)(C)c2c1)=C/C(O)=O
InChI Key: InChIKey=NNROJUAWMZCOPE-ZFWGQPRBSA-N
Data: 4 EC50
Activity Spreadsheet -- Enzyme Inhibition Constant Data from BindingDB
Found 4 hits for monomerid = 50066899
Trg + Lig
Ki
nM
ΔG°
kcal/mole
IC50
nM
Kd
nM
EC50/IC50
nM
koff
s-1
kon
M-1s-1
pHTemp
°C
Retinoid receptor
(Homo sapiens (Human))
BDBM50066899
((2E,4E,6E)-7-(4,4-Dimethyl-chroman-6-yl)-3-methyl-...)
Show SMILES C\C(\C=C\C=C(/C)c1ccc2OCCC(C)(C)c2c1)=C/C(O)=O
Show InChI InChI=1S/C20H24O3/c1-14(12-19(21)22)6-5-7-15(2)16-8-9-18-17(13-16)20(3,4)10-11-23-18/h5-9,12-13H,10-11H2,1-4H3,(H,21,22)/b6-5+,14-12+,15-7+
Reactome pathway
n/an/an/an/a 39n/an/an/an/a
University of Oklahoma Health Sciences Center
Curated by ChEMBL
Assay Description
Transcriptional activation in CV-1 cells expressing RAR-gamma receptor
J Med Chem 41: 3753-7 (1998)
Article DOI: 10.1021/jm980308p
BindingDB Entry DOI: 10.7270/Q2TB1628
Retinoid X receptor gamma/retinoic acid receptor alpha
(Homo sapiens (Human))
BDBM50066899
((2E,4E,6E)-7-(4,4-Dimethyl-chroman-6-yl)-3-methyl-...)
Show SMILES C\C(\C=C\C=C(/C)c1ccc2OCCC(C)(C)c2c1)=C/C(O)=O
Show InChI InChI=1S/C20H24O3/c1-14(12-19(21)22)6-5-7-15(2)16-8-9-18-17(13-16)20(3,4)10-11-23-18/h5-9,12-13H,10-11H2,1-4H3,(H,21,22)/b6-5+,14-12+,15-7+
NCI pathway
Reactome pathway
n/an/an/an/a 740n/an/an/an/a
University of Oklahoma Health Sciences Center
Curated by ChEMBL
Assay Description
Transcriptional activation in CV-1 cells expressing RAR-alpha receptor
J Med Chem 41: 3753-7 (1998)
Article DOI: 10.1021/jm980308p
BindingDB Entry DOI: 10.7270/Q2TB1628
Retinoid receptor
(Homo sapiens (Human))
BDBM50066899
((2E,4E,6E)-7-(4,4-Dimethyl-chroman-6-yl)-3-methyl-...)
Show SMILES C\C(\C=C\C=C(/C)c1ccc2OCCC(C)(C)c2c1)=C/C(O)=O
Show InChI InChI=1S/C20H24O3/c1-14(12-19(21)22)6-5-7-15(2)16-8-9-18-17(13-16)20(3,4)10-11-23-18/h5-9,12-13H,10-11H2,1-4H3,(H,21,22)/b6-5+,14-12+,15-7+
Reactome pathway
n/an/an/an/a 72n/an/an/an/a
University of Oklahoma Health Sciences Center
Curated by ChEMBL
Assay Description
Transcriptional activation in CV-1 cells expressing RAR-beta receptor
J Med Chem 41: 3753-7 (1998)
Article DOI: 10.1021/jm980308p
BindingDB Entry DOI: 10.7270/Q2TB1628
Retinoic acid receptor RXR-alpha
(Homo sapiens (Human))
BDBM50066899
((2E,4E,6E)-7-(4,4-Dimethyl-chroman-6-yl)-3-methyl-...)
Show SMILES C\C(\C=C\C=C(/C)c1ccc2OCCC(C)(C)c2c1)=C/C(O)=O
Show InChI InChI=1S/C20H24O3/c1-14(12-19(21)22)6-5-7-15(2)16-8-9-18-17(13-16)20(3,4)10-11-23-18/h5-9,12-13H,10-11H2,1-4H3,(H,21,22)/b6-5+,14-12+,15-7+
NCI pathway
Reactome pathway
n/an/an/an/a 2.80E+3n/an/an/an/a
University of Oklahoma Health Sciences Center
Curated by ChEMBL
Assay Description
Transcriptional activation in CV-1 cells expressing RAR-alpha receptor
J Med Chem 41: 3753-7 (1998)
Article DOI: 10.1021/jm980308p
BindingDB Entry DOI: 10.7270/Q2TB1628