BDBM50066930 6-Chloro-2-(3-methyl-benzylsulfanyl)-pyrimidin-4-ylamine::CHEMBL123779
SMILES: Cc1cccc(CSc2nc(N)cc(Cl)n2)c1
InChI Key: InChIKey=MCZLKCYGCXKUNC-UHFFFAOYSA-N
Data: 2 IC50
Activity Spreadsheet -- Enzyme Inhibition Constant Data from BindingDB
Found 2 hits for monomerid = 50066930
Trg + Lig
Ki
nM
ΔG°
kcal/mole
IC50
nM
Kd
nM
EC50/IC50
nM
koff
s-1
kon
M-1s-1
pHTemp
°C
Reverse transcriptase/RNaseH
(Human immunodeficiency virus 1)
BDBM50066930
(6-Chloro-2-(3-methyl-benzylsulfanyl)-pyrimidin-4-y...)
Show SMILES Cc1cccc(CSc2nc(N)cc(Cl)n2)c1
Show InChI InChI=1S/C12H12ClN3S/c1-8-3-2-4-9(5-8)7-17-12-15-10(13)6-11(14)16-12/h2-6H,7H2,1H3,(H2,14,15,16)
n/an/a 50n/an/an/an/an/an/a
Pharmacia & Upjohn
Curated by ChEMBL
Assay Description
Inhibition of HIV-1 reverse transcriptase (P236L)
J Med Chem 41: 3793-803 (1998)
Article DOI: 10.1021/jm9800806
BindingDB Entry DOI: 10.7270/Q2JS9PKT
Reverse transcriptase/RNaseH
(Human immunodeficiency virus 1)
BDBM50066930
(6-Chloro-2-(3-methyl-benzylsulfanyl)-pyrimidin-4-y...)
Show SMILES Cc1cccc(CSc2nc(N)cc(Cl)n2)c1
Show InChI InChI=1S/C12H12ClN3S/c1-8-3-2-4-9(5-8)7-17-12-15-10(13)6-11(14)16-12/h2-6H,7H2,1H3,(H2,14,15,16)
n/an/a 280n/an/an/an/an/an/a
Pharmacia & Upjohn
Curated by ChEMBL
Assay Description
Inhibition of HIV-1 reverse transcriptase (wild type)
J Med Chem 41: 3793-803 (1998)
Article DOI: 10.1021/jm9800806
BindingDB Entry DOI: 10.7270/Q2JS9PKT