BDBM50067192 CHEMBL3401751
SMILES: CCCc1nn(C)c2c1nc([nH]c2=O)-c1cc(ccc1OCC)S(=O)(=O)NCCN(CC)CC
InChI Key: InChIKey=XGTVCMMDZOADTP-UHFFFAOYSA-N
Data: 1 IC50
Activity Spreadsheet -- Enzyme Inhibition Constant Data from BindingDB
Found 1 hit for monomerid = 50067192
Trg + Lig
Ki
nM
ΔG°
kcal/mole
IC50
nM
Kd
nM
EC50/IC50
nM
koff
s-1
kon
M-1s-1
pHTemp
°C
cGMP-specific 3',5'-cyclic phosphodiesterase
(Homo sapiens (Human))
BDBM50067192
(CHEMBL3401751)
Show SMILES CCCc1nn(C)c2c1nc([nH]c2=O)-c1cc(ccc1OCC)S(=O)(=O)NCCN(CC)CC
Show InChI InChI=1S/C23H34N6O4S/c1-6-10-18-20-21(28(5)27-18)23(30)26-22(25-20)17-15-16(11-12-19(17)33-9-4)34(31,32)24-13-14-29(7-2)8-3/h11-12,15,24H,6-10,13-14H2,1-5H3,(H,25,26,30)
Reactome pathway
n/an/a 32n/an/an/an/an/an/a
CSIR-Indian Institute of Integrative Medicine
Curated by ChEMBL
Assay Description
Inhibition of PDE5A1 (unknown origin)
Bioorg Med Chem 23: 2121-8 (2015)
Article DOI: 10.1016/j.bmc.2015.03.005
BindingDB Entry DOI: 10.7270/Q28917JN