BDBM50067193 CHEMBL3401752
SMILES: CCCc1nn(C)c2c1nc([nH]c2=O)-c1cc(ccc1OCC)S(=O)(=O)NCCCN(C)C
InChI Key: InChIKey=KPUBOLXHXDXMFM-UHFFFAOYSA-N
Data: 1 IC50
Activity Spreadsheet -- Enzyme Inhibition Constant Data from BindingDB
Found 1 hit for monomerid = 50067193
Trg + Lig
Ki
nM
ΔG°
kcal/mole
IC50
nM
Kd
nM
EC50/IC50
nM
koff
s-1
kon
M-1s-1
pHTemp
°C
cGMP-specific 3',5'-cyclic phosphodiesterase
(Homo sapiens (Human))
BDBM50067193
(CHEMBL3401752)
Show SMILES CCCc1nn(C)c2c1nc([nH]c2=O)-c1cc(ccc1OCC)S(=O)(=O)NCCCN(C)C
Show InChI InChI=1S/C22H32N6O4S/c1-6-9-17-19-20(28(5)26-17)22(29)25-21(24-19)16-14-15(10-11-18(16)32-7-2)33(30,31)23-12-8-13-27(3)4/h10-11,14,23H,6-9,12-13H2,1-5H3,(H,24,25,29)
Reactome pathway
n/an/a 14n/an/an/an/an/an/a
CSIR-Indian Institute of Integrative Medicine
Curated by ChEMBL
Assay Description
Inhibition of PDE5A1 (unknown origin)
Bioorg Med Chem 23: 2121-8 (2015)
Article DOI: 10.1016/j.bmc.2015.03.005
BindingDB Entry DOI: 10.7270/Q28917JN